{"text_format":"1","workbook":"xlsx","n_sheets":5,"sheets":["技名","VL1","VL2","VL3","VL4"],"not_rendered":{"charts":0,"images":0,"macros":1,"external_links":0,"defined_names":16,"comments":0,"pivot_tables":0},"unopened":[],"bounds":{"document_bytes":16777216,"sheet_cells":100000,"rows_first":2000,"rows_last":500,"rows_between":2000,"halvings":0,"cell_chars":16384,"cell_head_chars":4096},"cells_cut":0,"cells_raw":0,"read":"whole","date_system":"1900"}

{"sheet":"技名","index":0,"n_rows":36,"n_cols":41,"rows_kept":36,"cut":false,"hidden":false,"merged":[[20,25,20,56],[19,25,19,56],[26,25,26,56],[0,1,0,56],[2,1,2,3],[5,1,5,3],[5,4,5,6],[5,7,5,9],[5,12,5,14],[5,10,5,11],[3,28,3,38],[5,15,5,17],[5,18,5,21],[5,22,5,24],[5,25,5,56],[6,1,6,3],[6,4,6,6],[6,7,6,9],[6,12,6,14],[6,15,6,17],[6,10,6,11],[9,1,9,3],[10,28,10,38],[12,1,12,3],[12,4,12,6],[12,10,12,11],[12,12,12,14],[12,25,12,56],[6,18,6,21],[6,22,6,24],[6,25,6,56],[12,7,12,9],[13,7,13,9],[12,15,12,17],[12,18,12,21],[12,22,12,24],[13,25,13,56],[16,1,16,3],[17,28,17,38],[13,1,13,3],[13,4,13,6],[13,10,13,11],[13,12,13,14],[13,15,13,17],[13,18,13,21],[13,22,13,24],[19,18,19,21],[19,22,19,24],[20,1,20,3],[20,4,20,6],[20,7,20,9],[20,10,20,11],[20,12,20,14],[20,15,20,17],[20,18,20,21],[20,22,20,24],[19,15,19,17],[19,1,19,3],[19,4,19,6],[19,7,19,9],[19,10,19,11],[19,12,19,14],[23,1,23,3],[24,28,24,38],[26,1,26,3],[26,4,26,6],[26,7,26,9],[26,10,26,11],[26,12,26,14],[26,15,26,17],[26,18,26,21],[26,22,26,24],[27,1,27,3],[27,4,27,6],[27,7,27,9],[35,1,35,56],[30,1,30,56],[31,1,31,56],[32,1,32,56],[33,1,33,56],[34,1,34,56],[27,10,27,11],[27,12,27,14],[27,15,27,17],[27,18,27,21],[27,22,27,24],[27,25,27,56]]}
[null,"DTB技検証ツール　※技名のところに文字を置いていくだけです。文字は左詰めでも右詰めでも問題なく動きます (作成者：スピード)"]
[]
[null,"技名1"]
[null,null,null,null,null,null,null,null,null,null,null,null,null,null,null,null,null,null,null,null,null,null,null,null,null,null,null,null,"呪・永・禁がある場合の符号(正or負)",null,null,null,null,null,null,null,null,null,null,"＞","正"]
[]
[null,"種別",null,null,"ﾀｲﾐﾝｸﾞ",null,null,"対象",null,null,"射程",null,"判定値",null,null,"コスト",null,null,"代償",null,null,null,"威力",null,null," 効果"]
[null,{"$f":"\"\"&VLOOKUP($B$4,'VL1'!$B$1:$P$200,2,)&\"\"&VLOOKUP($C$4,'VL1'!$B$1:$P$200,2,)&\"\"&VLOOKUP($D$4,'VL1'!$B$1:$P$200,2,)&\n\"\"&VLOOKUP($E$4,'VL1'!$B$1:$P$200,2,)&\"\"&VLOOKUP($F$4,'VL1'!$B$1:$P$200,2,)&\"\"&VLOOKUP($G$4,'VL1'!$B$1:$P$200,2,)&\n\"\"&VLOOKUP($H$4,'VL1'!$B$1:$P$200,2,)&\"\"&VLOOKUP($I$4,'VL1'!$B$1:$P$200,2,)&\"\"&VLOOKUP($J$4,'VL1'!$B$1:$P$200,2,)&\n\"\"&VLOOKUP($K$4,'VL1'!$B$1:$P$200,2,)","v":""},null,null,{"$f":"\"\"&VLOOKUP($B$4,'VL1'!$B$1:$P$200,3,)&\"\"&VLOOKUP($C$4,'VL1'!$B$1:$P$200,3,)&\"\"&VLOOKUP($D$4,'VL1'!$B$1:$P$200,3,)&\n\"\"&VLOOKUP($E$4,'VL1'!$B$1:$P$200,3,)&\"\"&VLOOKUP($F$4,'VL1'!$B$1:$P$200,3,)&\"\"&VLOOKUP($G$4,'VL1'!$B$1:$P$200,3,)&\n\"\"&VLOOKUP($H$4,'VL1'!$B$1:$P$200,3,)&\"\"&VLOOKUP($I$4,'VL1'!$B$1:$P$200,3,)&\"\"&VLOOKUP($J$4,'VL1'!$B$1:$P$200,3,)&\n\"\"&VLOOKUP($K$4,'VL1'!$B$1:$P$200,3,)","v":""},null,null,{"$f":"'VL1'!$T$3","v":0},null,null,{"$f":"VLOOKUP($B$4,'VL1'!$B$1:$P$200,6,)+VLOOKUP($C$4,'VL1'!$B$1:$P$200,6,)+VLOOKUP($D$4,'VL1'!$B$1:$P$200,6,)\n+VLOOKUP($E$4,'VL1'!$B$1:$P$200,6,)+VLOOKUP($F$4,'VL1'!$B$1:$P$200,6,)+VLOOKUP($G$4,'VL1'!$B$1:$P$200,6,)\n+VLOOKUP($H$4,'VL1'!$B$1:$P$200,6,)+VLOOKUP($I$4,'VL1'!$B$1:$P$200,6,)+VLOOKUP($J$4,'VL1'!$B$1:$P$200,6,)\n+VLOOKUP($K$4,'VL1'!$B$1:$P$200,6,)","v":0},null,{"$f":"VLOOKUP($B$4,'VL1'!$B$1:$P$200,7,)+VLOOKUP($C$4,'VL1'!$B$1:$P$200,7,)+VLOOKUP($D$4,'VL1'!$B$1:$P$200,7,)\n+VLOOKUP($E$4,'VL1'!$B$1:$P$200,7,)+VLOOKUP($F$4,'VL1'!$B$1:$P$200,7,)+VLOOKUP($G$4,'VL1'!$B$1:$P$200,7,)\n+VLOOKUP($H$4,'VL1'!$B$1:$P$200,7,)+VLOOKUP($I$4,'VL1'!$B$1:$P$200,7,)+VLOOKUP($J$4,'VL1'!$B$1:$P$200,7,)\n+VLOOKUP($K$4,'VL1'!$B$1:$P$200,7,)","v":0},null,null,{"$f":"VLOOKUP($B$4,'VL1'!$B$1:$P$200,8,)+VLOOKUP($C$4,'VL1'!$B$1:$P$200,8,)+VLOOKUP($D$4,'VL1'!$B$1:$P$200,8,)\n+VLOOKUP($E$4,'VL1'!$B$1:$P$200,8,)+VLOOKUP($F$4,'VL1'!$B$1:$P$200,8,)+VLOOKUP($G$4,'VL1'!$B$1:$P$200,8,)\n+VLOOKUP($H$4,'VL1'!$B$1:$P$200,8,)+VLOOKUP($I$4,'VL1'!$B$1:$P$200,8,)+VLOOKUP($J$4,'VL1'!$B$1:$P$200,8,)\n+VLOOKUP($K$4,'VL1'!$B$1:$P$200,8,)","v":0},null,null,{"$f":"'VL1'!$T$8","v":"なし"},null,null,null,{"$f":"VLOOKUP($B$4,'VL1'!$B$1:$P$200,12,)+VLOOKUP($C$4,'VL1'!$B$1:$P$200,12,)+VLOOKUP($D$4,'VL1'!$B$1:$P$200,12,)\n+VLOOKUP($E$4,'VL1'!$B$1:$P$200,12,)+VLOOKUP($F$4,'VL1'!$B$1:$P$200,12,)+VLOOKUP($G$4,'VL1'!$B$1:$P$200,12,)\n+VLOOKUP($H$4,'VL1'!$B$1:$P$200,12,)+VLOOKUP($I$4,'VL1'!$B$1:$P$200,12,)+VLOOKUP($J$4,'VL1'!$B$1:$P$200,12,)\n+VLOOKUP($K$4,'VL1'!$B$1:$P$200,12,)","v":0},null,null,{"$f":"IF(VLOOKUP($B$4,'VL1'!$B$1:$P$200,2,)=\"\",\"\",VLOOKUP($B$4,'VL1'!$B$1:$P$200,15,))\n&IF(VLOOKUP($C$4,'VL1'!$B$1:$P$200,2,)=\"\",\"\",VLOOKUP($C$4,'VL1'!$B$1:$P$200,15,))\n&IF(VLOOKUP($D$4,'VL1'!$B$1:$P$200,2,)=\"\",\"\",VLOOKUP($D$4,'VL1'!$B$1:$P$200,15,))\n&IF(VLOOKUP($E$4,'VL1'!$B$1:$P$200,2,)=\"\",\"\",VLOOKUP($E$4,'VL1'!$B$1:$P$200,15,))\n&IF(VLOOKUP($F$4,'VL1'!$B$1:$P$200,2,)=\"\",\"\",VLOOKUP($F$4,'VL1'!$B$1:$P$200,15,))\n&IF(VLOOKUP($G$4,'VL1'!$B$1:$P$200,2,)=\"\",\"\",VLOOKUP($G$4,'VL1'!$B$1:$P$200,15,))\n&IF(VLOOKUP($H$4,'VL1'!$B$1:$P$200,2,)=\"\",\"\",VLOOKUP($H$4,'VL1'!$B$1:$P$200,15,))\n&IF(VLOOKUP($I$4,'VL1'!$B$1:$P$200,2,)=\"\",\"\",VLOOKUP($I$4,'VL1'!$B$1:$P$200,15,))\n&IF(VLOOKUP($J$4,'VL1'!$B$1:$P$200,2,)=\"\",\"\",VLOOKUP($J$4,'VL1'!$B$1:$P$200,15,))\n&IF(VLOOKUP($K$4,'VL1'!$B$1:$P$200,2,)=\"\",\"\",VLOOKUP($K$4,'VL1'!$B$1:$P$200,15,))\n&IF(BSー1=0,\"\",\" BS\"&BSー1&\"付与\")\n&IF(OR(B4=\"触\",C4=\"触\",D4=\"触\",E4=\"触\",F4=\"触\",G4=\"触\",H4=\"触\",I4=\"触\",J4=\"触\",K4=\"触\")=TRUE,\" [任意BS1つ付与]\",\"\")\n&IF(OR(B4=\"獄\",C4=\"獄\",D4=\"獄\",E4=\"獄\",F4=\"獄\",G4=\"獄\",H4=\"獄\",I4=\"獄\",J4=\"獄\",K4=\"獄\")=TRUE,\" [与えたダメージの半分、自身のHPを回復]\",\"\")\n&IF(OR(B4=\"滅\",C4=\"滅\",D4=\"滅\",E4=\"滅\",F4=\"滅\",G4=\"滅\",H4=\"滅\",I4=\"滅\",J4=\"滅\",K4=\"滅\")=TRUE,\" [HPの半分消費し、消費分威力上昇  1回/シーン]\",\"\")\n&IF(OR(B4=\"痺\",C4=\"痺\",D4=\"痺\",E4=\"痺\",F4=\"痺\",G4=\"痺\",H4=\"痺\",I4=\"痺\",J4=\"痺\",K4=\"痺\")=TRUE,\" [BS麻痺付与]\",\"\")\n&IF(OR(B4=\"毒\",C4=\"毒\",D4=\"毒\",E4=\"毒\",F4=\"毒\",G4=\"毒\",H4=\"毒\",I4=\"毒\",J4=\"毒\",K4=\"毒\")=TRUE,\" [BS毒付与]\",\"\")\n&IF(OR(B4=\"縛\",C4=\"縛\",D4=\"縛\",E4=\"縛\",F4=\"縛\",G4=\"縛\",H4=\"縛\",I4=\"縛\",J4=\"縛\",K4=\"縛\")=TRUE,\" [BS拘束付与]\",\"\")\n&IF(OR(B4=\"封\",C4=\"封\",D4=\"封\",E4=\"封\",F4=\"封\",G4=\"封\",H4=\"封\",I4=\"封\",J4=\"封\",K4=\"封\")=TRUE,\" [BS封印付与]\",\"\")","v":""}]
[]
[]
[null,"技名2"]
{"$rows_left_out":27}
{"sheet":"VL1","index":1,"n_rows":177,"n_cols":24,"rows_kept":177,"cut":false,"hidden":false,"merged":[]}
[null,"＼","種別","ﾀｲﾐﾝｸﾞ","対象A","対象B","射程","判定値","コスト","代償A","代償B","属性","威力","BS回復","BS","効果"]
[null,"剣","攻撃","メイン",1,1,2,15,1,3,0,0,4,0,0,{"$f":"威力1&\"点の\"&IF(属性1=\"無\",\"\",属性1&\"属性\")&\"攻撃を行う\"","v":"0点の攻撃を行う"}]
[null,"斬","攻撃","メイン",1,1,2,15,5,4,0,0,8,0,0,{"$f":"威力1&\"点の\"&IF(属性1=\"無\",\"\",属性1&\"属性\")&\"攻撃を行う\"","v":"0点の攻撃を行う"},4,"対象A",{"$f":"VLOOKUP(技名!$B$4,$B$1:$P$200,$Q3,)+VLOOKUP(技名!$C$4,$B$1:$P$200,$Q3,)+VLOOKUP(技名!$D$4,$B$1:$P$200,$Q3,)+\nVLOOKUP(技名!$E$4,$B$1:$P$200,$Q3,)+VLOOKUP(技名!$F$4,$B$1:$P$200,$Q3,)+VLOOKUP(技名!$G$4,$B$1:$P$200,$Q3,)+\nVLOOKUP(技名!$H$4,$B$1:$P$200,$Q3,)+VLOOKUP(技名!$I$4,$B$1:$P$200,$Q3,)+VLOOKUP(技名!$J$4,$B$1:$P$200,$Q3,)+\nVLOOKUP(技名!$K$4,$B$1:$P$200,$Q3,)","v":0},{"$f":"IF(S3>=-5,IF(COUNTIF(技名!B4:K4,\"刹\")=0,IF(S3>=6,\"各ﾏｽ全体\",IF(S4=1,IF(S3=1,\"単体\",S3&\"体\"),IF(S4=2,S3&\"マス\",IF(S4=3,\"各ﾏｽ\"&S3&\"体\",)))),\"単体\"),\"自身\")","v":0}]
[null,"裂","攻撃","メイン",1,3,4,14,4,0,1,0,6,0,0,{"$f":"威力1&\"点の\"&IF(属性1=\"無\",\"\",属性1&\"属性\")&\"攻撃を行う\"","v":"0点の攻撃を行う"},5,"対象B",{"$f":"VLOOKUP(技名!$B$4,$B$1:$P$200,$Q4,)+VLOOKUP(技名!$C$4,$B$1:$P$200,$Q4,)+VLOOKUP(技名!$D$4,$B$1:$P$200,$Q4,)+\nVLOOKUP(技名!$E$4,$B$1:$P$200,$Q4,)+VLOOKUP(技名!$F$4,$B$1:$P$200,$Q4,)+VLOOKUP(技名!$G$4,$B$1:$P$200,$Q4,)+\nVLOOKUP(技名!$H$4,$B$1:$P$200,$Q4,)+VLOOKUP(技名!$I$4,$B$1:$P$200,$Q4,)+VLOOKUP(技名!$J$4,$B$1:$P$200,$Q4,)+\nVLOOKUP(技名!$K$4,$B$1:$P$200,$Q4,)","v":0}]
[null,"盾","カバー","判定直後",1,1,2,15,1,2,0,0,5,0,0,{"$f":"\"ダメージを肩代わりし、\"&威力1&\"点軽減\"&IF(属性1=\"無\",\"\",\" (\"&属性1&\"属性)\")","v":"ダメージを肩代わりし、0点軽減"},null,"射程",null,null,null,0,"無"]
[null,"壁","軽減","対象宣言時",1,1,4,13,6,0,1,0,1,0,0,{"$f":"\"攻撃対象を自身に変更し、\"&威力1&\"点軽減\"&IF(属性1=\"無\",\"\",\" (\"&属性1&\"属性)\")","v":"攻撃対象を自身に変更し、0点軽減"},null,"判定値",null,null,null,1,"火","火傷"]
[null,"打","攻撃","メイン",1,1,1,14,6,3,0,0,10,0,0,{"$f":"威力1&\"点の\"&IF(属性1=\"無\",\"\",属性1&\"属性\")&\"攻撃を行う\"","v":"0点の攻撃を行う"},null,"コスト",null,null,null,2,"水","拘束"]
[null,"術","攻撃","メイン",1,1,4,15,2,0,2,0,5,0,0,{"$f":"威力1&\"点の\"&IF(属性1=\"無\",\"\",属性1&\"属性\")&\"攻撃を行う\"","v":"0点の攻撃を行う"},9,"代償A",{"$f":"VLOOKUP(技名!$B$4,$B$1:$P$200,$Q8,)+VLOOKUP(技名!$C$4,$B$1:$P$200,$Q8,)+VLOOKUP(技名!$D$4,$B$1:$P$200,$Q8,)+\nVLOOKUP(技名!$E$4,$B$1:$P$200,$Q8,)+VLOOKUP(技名!$F$4,$B$1:$P$200,$Q8,)+VLOOKUP(技名!$G$4,$B$1:$P$200,$Q8,)+\nVLOOKUP(技名!$H$4,$B$1:$P$200,$Q8,)+VLOOKUP(技名!$I$4,$B$1:$P$200,$Q8,)+VLOOKUP(技名!$J$4,$B$1:$P$200,$Q8,)+\nVLOOKUP(技名!$K$4,$B$1:$P$200,$Q8,)","v":0},{"$f":"IF(AND(S8=0,S9=0),\"なし\",IF(S8=0,\"\",S8&\"AP\")&IF(AND(S8>=1,S9>=1)=TRUE,\"+\",\"\")&IF(S9=0,\"\",S9&\"BP\"))","v":"なし"},null,3,"雷","麻痺"]
[null,"砲","攻撃","メイン",1,2,3,12,4,4,0,0,10,0,0,{"$f":"威力1&\"点の\"&IF(属性1=\"無\",\"\",属性1&\"属性\")&\"攻撃を行う\"","v":"0点の攻撃を行う"},10,"代償B",{"$f":"VLOOKUP(技名!$B$4,$B$1:$P$200,$Q9,)+VLOOKUP(技名!$C$4,$B$1:$P$200,$Q9,)+VLOOKUP(技名!$D$4,$B$1:$P$200,$Q9,)+\nVLOOKUP(技名!$E$4,$B$1:$P$200,$Q9,)+VLOOKUP(技名!$F$4,$B$1:$P$200,$Q9,)+VLOOKUP(技名!$G$4,$B$1:$P$200,$Q9,)+\nVLOOKUP(技名!$H$4,$B$1:$P$200,$Q9,)+VLOOKUP(技名!$I$4,$B$1:$P$200,$Q9,)+VLOOKUP(技名!$J$4,$B$1:$P$200,$Q9,)+\nVLOOKUP(技名!$K$4,$B$1:$P$200,$Q9,)","v":0},null,null,4,"地","石化"]
[null,"蘇","回復","メイン",1,1,1,12,2,0,1,0,1,0,0,{"$f":"\"戦闘不能を解除し、HPを\"&威力1&\"点回復\"","v":"戦闘不能を解除し、HPを0点回復"},11,"属性",{"$f":"MAX(VLOOKUP(技名!$B$4,$B$1:$P$200,$Q10,),VLOOKUP(技名!$C$4,$B$1:$P$200,$Q10,),VLOOKUP(技名!$D$4,$B$1:$P$200,$Q10,),\nVLOOKUP(技名!$E$4,$B$1:$P$200,$Q10,),VLOOKUP(技名!$F$4,$B$1:$P$200,$Q10,),VLOOKUP(技名!$G$4,$B$1:$P$200,$Q10,),\nVLOOKUP(技名!$H$4,$B$1:$P$200,$Q10,),VLOOKUP(技名!$I$4,$B$1:$P$200,$Q10,),VLOOKUP(技名!$J$4,$B$1:$P$200,$Q10,),\nVLOOKUP(技名!$K$4,$B$1:$P$200,$Q10,))","v":0},{"$f":"VLOOKUP(S10,V5:W13,2,)","v":"無"},null,5,"風","封印"]
{"$rows_left_out":168}
{"sheet":"VL2","index":2,"n_rows":177,"n_cols":24,"rows_kept":177,"cut":false,"hidden":false,"merged":[]}
[null,"＼","種別","ﾀｲﾐﾝｸﾞ","対象A","対象B","射程","判定値","コスト","代償A","代償B","属性","威力","BS回復","BS","効果"]
[null,"剣","攻撃","メイン",1,1,2,15,1,3,0,0,4,0,0,{"$f":"威力2&\"点の\"&IF(属性2=\"無\",\"\",属性2&\"属性\")&\"攻撃を行う\"","v":"0点の攻撃を行う"}]
[null,"斬","攻撃","メイン",1,1,2,15,5,4,0,0,8,0,0,{"$f":"威力2&\"点の\"&IF(属性2=\"無\",\"\",属性2&\"属性\")&\"攻撃を行う\"","v":"0点の攻撃を行う"},4,"対象A",{"$f":"VLOOKUP(技名!$B$11,$B$1:$P$200,$Q3,)+VLOOKUP(技名!$C$11,$B$1:$P$200,$Q3,)+VLOOKUP(技名!$D$11,$B$1:$P$200,$Q3,)+\nVLOOKUP(技名!$E$11,$B$1:$P$200,$Q3,)+VLOOKUP(技名!$F$11,$B$1:$P$200,$Q3,)+VLOOKUP(技名!$G$11,$B$1:$P$200,$Q3,)+\nVLOOKUP(技名!$H$11,$B$1:$P$200,$Q3,)+VLOOKUP(技名!$I$11,$B$1:$P$200,$Q3,)+VLOOKUP(技名!$J$11,$B$1:$P$200,$Q3,)+\nVLOOKUP(技名!$K$11,$B$1:$P$200,$Q3,)","v":0},{"$f":"IF(S3>=-5,IF(COUNTIF(技名!B11:K11,\"刹\")=0,IF(S3>=6,\"各ﾏｽ全体\",IF(S4=1,IF(S3=1,\"単体\",S3&\"体\"),IF(S4=2,S3&\"マス\",IF(S4=3,\"各ﾏｽ\"&S3&\"体\",)))),\"単体\"),\"自身\")","v":0}]
[null,"裂","攻撃","メイン",1,3,4,14,4,0,1,0,6,0,0,{"$f":"威力2&\"点の\"&IF(属性2=\"無\",\"\",属性2&\"属性\")&\"攻撃を行う\"","v":"0点の攻撃を行う"},5,"対象B",{"$f":"VLOOKUP(技名!$B$11,$B$1:$P$200,$Q4,)+VLOOKUP(技名!$C$11,$B$1:$P$200,$Q4,)+VLOOKUP(技名!$D$11,$B$1:$P$200,$Q4,)+\nVLOOKUP(技名!$E$11,$B$1:$P$200,$Q4,)+VLOOKUP(技名!$F$11,$B$1:$P$200,$Q4,)+VLOOKUP(技名!$G$11,$B$1:$P$200,$Q4,)+\nVLOOKUP(技名!$H$11,$B$1:$P$200,$Q4,)+VLOOKUP(技名!$I$11,$B$1:$P$200,$Q4,)+VLOOKUP(技名!$J$11,$B$1:$P$200,$Q4,)+\nVLOOKUP(技名!$K$11,$B$1:$P$200,$Q4,)","v":0}]
[null,"盾","カバー","判定直後",1,1,2,15,1,2,0,0,5,0,0,{"$f":"\"ダメージを肩代わりし、\"&威力2&\"点軽減\"&IF(属性2=\"無\",\"\",\" (\"&属性2&\"属性)\")","v":"ダメージを肩代わりし、0点軽減"},null,"射程",null,null,null,0,"無"]
[null,"壁","軽減","対象宣言時",1,1,4,13,6,0,1,0,1,0,0,{"$f":"\"攻撃対象を自身に変更し、\"&威力2&\"点軽減\"&IF(属性2=\"無\",\"\",\" (\"&属性2&\"属性)\")","v":"攻撃対象を自身に変更し、0点軽減"},null,"判定値",null,null,null,1,"火","火傷"]
[null,"打","攻撃","メイン",1,1,1,14,6,3,0,0,10,0,0,{"$f":"威力2&\"点の\"&IF(属性2=\"無\",\"\",属性2&\"属性\")&\"攻撃を行う\"","v":"0点の攻撃を行う"},null,"コスト",null,null,null,2,"水","拘束"]
[null,"術","攻撃","メイン",1,1,4,15,2,0,2,0,5,0,0,{"$f":"威力2&\"点の\"&IF(属性2=\"無\",\"\",属性2&\"属性\")&\"攻撃を行う\"","v":"0点の攻撃を行う"},9,"代償A",{"$f":"VLOOKUP(技名!$B$11,$B$1:$P$200,$Q8,)+VLOOKUP(技名!$C$11,$B$1:$P$200,$Q8,)+VLOOKUP(技名!$D$11,$B$1:$P$200,$Q8,)+\nVLOOKUP(技名!$E$11,$B$1:$P$200,$Q8,)+VLOOKUP(技名!$F$11,$B$1:$P$200,$Q8,)+VLOOKUP(技名!$G$11,$B$1:$P$200,$Q8,)+\nVLOOKUP(技名!$H$11,$B$1:$P$200,$Q8,)+VLOOKUP(技名!$I$11,$B$1:$P$200,$Q8,)+VLOOKUP(技名!$J$11,$B$1:$P$200,$Q8,)+\nVLOOKUP(技名!$K$11,$B$1:$P$200,$Q8,)","v":0},{"$f":"IF(AND(S8=0,S9=0),\"なし\",IF(S8=0,\"\",S8&\"AP\")&IF(AND(S8>=1,S9>=1)=TRUE,\"+\",\"\")&IF(S9=0,\"\",S9&\"BP\"))","v":"なし"},null,3,"雷","麻痺"]
[null,"砲","攻撃","メイン",1,2,3,12,4,4,0,0,10,0,0,{"$f":"威力2&\"点の\"&IF(属性2=\"無\",\"\",属性2&\"属性\")&\"攻撃を行う\"","v":"0点の攻撃を行う"},10,"代償B",{"$f":"VLOOKUP(技名!$B$11,$B$1:$P$200,$Q9,)+VLOOKUP(技名!$C$11,$B$1:$P$200,$Q9,)+VLOOKUP(技名!$D$11,$B$1:$P$200,$Q9,)+\nVLOOKUP(技名!$E$11,$B$1:$P$200,$Q9,)+VLOOKUP(技名!$F$11,$B$1:$P$200,$Q9,)+VLOOKUP(技名!$G$11,$B$1:$P$200,$Q9,)+\nVLOOKUP(技名!$H$11,$B$1:$P$200,$Q9,)+VLOOKUP(技名!$I$11,$B$1:$P$200,$Q9,)+VLOOKUP(技名!$J$11,$B$1:$P$200,$Q9,)+\nVLOOKUP(技名!$K$11,$B$1:$P$200,$Q9,)","v":0},null,null,4,"地","石化"]
[null,"蘇","回復","メイン",1,1,1,12,2,0,1,0,1,0,0,{"$f":"\"戦闘不能を解除し、HPを\"&威力2&\"点回復\"","v":"戦闘不能を解除し、HPを0点回復"},11,"属性",{"$f":"MAX(VLOOKUP(技名!$B$11,$B$1:$P$200,$Q10,),VLOOKUP(技名!$C$11,$B$1:$P$200,$Q10,),VLOOKUP(技名!$D$11,$B$1:$P$200,$Q10,),\nVLOOKUP(技名!$E$11,$B$1:$P$200,$Q10,),VLOOKUP(技名!$F$11,$B$1:$P$200,$Q10,),VLOOKUP(技名!$G$11,$B$1:$P$200,$Q10,),\nVLOOKUP(技名!$H$11,$B$1:$P$200,$Q10,),VLOOKUP(技名!$I$11,$B$1:$P$200,$Q10,),VLOOKUP(技名!$J$11,$B$1:$P$200,$Q10,),\nVLOOKUP(技名!$K$11,$B$1:$P$200,$Q10,))","v":0},{"$f":"VLOOKUP(S10,V5:W13,2,)","v":"無"},null,5,"風","封印"]
{"$rows_left_out":168}
{"sheet":"VL3","index":3,"n_rows":177,"n_cols":24,"rows_kept":177,"cut":false,"hidden":false,"merged":[]}
[null,"＼","種別","ﾀｲﾐﾝｸﾞ","対象A","対象B","射程","判定値","コスト","代償A","代償B","属性","威力","BS回復","BS","効果"]
[null,"剣","攻撃","メイン",1,1,2,15,1,3,0,0,4,0,0,{"$f":"威力3&\"点の\"&IF(属性3=\"無\",\"\",属性3&\"属性\")&\"攻撃を行う\"","v":"0点の攻撃を行う"}]
[null,"斬","攻撃","メイン",1,1,2,15,5,4,0,0,8,0,0,{"$f":"威力3&\"点の\"&IF(属性3=\"無\",\"\",属性3&\"属性\")&\"攻撃を行う\"","v":"0点の攻撃を行う"},4,"対象A",{"$f":"VLOOKUP(技名!$B$18,$B$1:$P$200,$Q3,)+VLOOKUP(技名!$C$18,$B$1:$P$200,$Q3,)+VLOOKUP(技名!$D$18,$B$1:$P$200,$Q3,)+\nVLOOKUP(技名!$E$18,$B$1:$P$200,$Q3,)+VLOOKUP(技名!$F$18,$B$1:$P$200,$Q3,)+VLOOKUP(技名!$G$18,$B$1:$P$200,$Q3,)+\nVLOOKUP(技名!$H$18,$B$1:$P$200,$Q3,)+VLOOKUP(技名!$I$18,$B$1:$P$200,$Q3,)+VLOOKUP(技名!$J$18,$B$1:$P$200,$Q3,)+\nVLOOKUP(技名!$K$18,$B$1:$P$200,$Q3,)","v":0},{"$f":"IF(S3>=-5,IF(COUNTIF(技名!B18:K18,\"刹\")=0,IF(S3>=6,\"各ﾏｽ全体\",IF(S4=1,IF(S3=1,\"単体\",S3&\"体\"),IF(S4=2,S3&\"マス\",IF(S4=3,\"各ﾏｽ\"&S3&\"体\",)))),\"単体\"),\"自身\")","v":0}]
[null,"裂","攻撃","メイン",1,3,4,14,4,0,1,0,6,0,0,{"$f":"威力3&\"点の\"&IF(属性3=\"無\",\"\",属性3&\"属性\")&\"攻撃を行う\"","v":"0点の攻撃を行う"},5,"対象B",{"$f":"VLOOKUP(技名!$B$18,$B$1:$P$200,$Q4,)+VLOOKUP(技名!$C$18,$B$1:$P$200,$Q4,)+VLOOKUP(技名!$D$18,$B$1:$P$200,$Q4,)+\nVLOOKUP(技名!$E$18,$B$1:$P$200,$Q4,)+VLOOKUP(技名!$F$18,$B$1:$P$200,$Q4,)+VLOOKUP(技名!$G$18,$B$1:$P$200,$Q4,)+\nVLOOKUP(技名!$H$18,$B$1:$P$200,$Q4,)+VLOOKUP(技名!$I$18,$B$1:$P$200,$Q4,)+VLOOKUP(技名!$J$18,$B$1:$P$200,$Q4,)+\nVLOOKUP(技名!$K$18,$B$1:$P$200,$Q4,)","v":0}]
[null,"盾","カバー","判定直後",1,1,2,15,1,2,0,0,5,0,0,{"$f":"\"ダメージを肩代わりし、\"&威力3&\"点軽減\"&IF(属性3=\"無\",\"\",\" (\"&属性3&\"属性)\")","v":"ダメージを肩代わりし、0点軽減"},null,"射程",null,null,null,0,"無"]
[null,"壁","軽減","対象宣言時",1,1,4,13,6,0,1,0,1,0,0,{"$f":"\"攻撃対象を自身に変更し、\"&威力3&\"点軽減\"&IF(属性3=\"無\",\"\",\" (\"&属性3&\"属性)\")","v":"攻撃対象を自身に変更し、0点軽減"},null,"判定値",null,null,null,1,"火","火傷"]
[null,"打","攻撃","メイン",1,1,1,14,6,3,0,0,10,0,0,{"$f":"威力3&\"点の\"&IF(属性3=\"無\",\"\",属性3&\"属性\")&\"攻撃を行う\"","v":"0点の攻撃を行う"},null,"コスト",null,null,null,2,"水","拘束"]
[null,"術","攻撃","メイン",1,1,4,15,2,0,2,0,5,0,0,{"$f":"威力3&\"点の\"&IF(属性3=\"無\",\"\",属性3&\"属性\")&\"攻撃を行う\"","v":"0点の攻撃を行う"},9,"代償A",{"$f":"VLOOKUP(技名!$B$18,$B$1:$P$200,$Q8,)+VLOOKUP(技名!$C$18,$B$1:$P$200,$Q8,)+VLOOKUP(技名!$D$18,$B$1:$P$200,$Q8,)+\nVLOOKUP(技名!$E$18,$B$1:$P$200,$Q8,)+VLOOKUP(技名!$F$18,$B$1:$P$200,$Q8,)+VLOOKUP(技名!$G$18,$B$1:$P$200,$Q8,)+\nVLOOKUP(技名!$H$18,$B$1:$P$200,$Q8,)+VLOOKUP(技名!$I$18,$B$1:$P$200,$Q8,)+VLOOKUP(技名!$J$18,$B$1:$P$200,$Q8,)+\nVLOOKUP(技名!$K$18,$B$1:$P$200,$Q8,)","v":0},{"$f":"IF(AND(S8=0,S9=0),\"なし\",IF(S8=0,\"\",S8&\"AP\")&IF(AND(S8>=1,S9>=1)=TRUE,\"+\",\"\")&IF(S9=0,\"\",S9&\"BP\"))","v":"なし"},null,3,"雷","麻痺"]
[null,"砲","攻撃","メイン",1,2,3,12,4,4,0,0,10,0,0,{"$f":"威力3&\"点の\"&IF(属性3=\"無\",\"\",属性3&\"属性\")&\"攻撃を行う\"","v":"0点の攻撃を行う"},10,"代償B",{"$f":"VLOOKUP(技名!$B$18,$B$1:$P$200,$Q9,)+VLOOKUP(技名!$C$18,$B$1:$P$200,$Q9,)+VLOOKUP(技名!$D$18,$B$1:$P$200,$Q9,)+\nVLOOKUP(技名!$E$18,$B$1:$P$200,$Q9,)+VLOOKUP(技名!$F$18,$B$1:$P$200,$Q9,)+VLOOKUP(技名!$G$18,$B$1:$P$200,$Q9,)+\nVLOOKUP(技名!$H$18,$B$1:$P$200,$Q9,)+VLOOKUP(技名!$I$18,$B$1:$P$200,$Q9,)+VLOOKUP(技名!$J$18,$B$1:$P$200,$Q9,)+\nVLOOKUP(技名!$K$18,$B$1:$P$200,$Q9,)","v":0},null,null,4,"地","石化"]
[null,"蘇","回復","メイン",1,1,1,12,2,0,1,0,1,0,0,{"$f":"\"戦闘不能を解除し、HPを\"&威力3&\"点回復\"","v":"戦闘不能を解除し、HPを0点回復"},11,"属性",{"$f":"MAX(VLOOKUP(技名!$B$18,$B$1:$P$200,$Q10,),VLOOKUP(技名!$C$18,$B$1:$P$200,$Q10,),VLOOKUP(技名!$D$18,$B$1:$P$200,$Q10,),\nVLOOKUP(技名!$E$18,$B$1:$P$200,$Q10,),VLOOKUP(技名!$F$18,$B$1:$P$200,$Q10,),VLOOKUP(技名!$G$18,$B$1:$P$200,$Q10,),\nVLOOKUP(技名!$H$18,$B$1:$P$200,$Q10,),VLOOKUP(技名!$I$18,$B$1:$P$200,$Q10,),VLOOKUP(技名!$J$18,$B$1:$P$200,$Q10,),\nVLOOKUP(技名!$K$18,$B$1:$P$200,$Q10,))","v":0},{"$f":"VLOOKUP(S10,V5:W13,2,)","v":"無"},null,5,"風","封印"]
{"$rows_left_out":168}
{"sheet":"VL4","index":4,"n_rows":177,"n_cols":24,"rows_kept":177,"cut":false,"hidden":false,"merged":[]}
[null,"＼","種別","ﾀｲﾐﾝｸﾞ","対象A","対象B","射程","判定値","コスト","代償A","代償B","属性","威力","BS回復","BS","効果"]
[null,"剣","攻撃","メイン",1,1,2,15,1,3,0,0,4,0,0,{"$f":"威力4&\"点の\"&IF(属性4=\"無\",\"\",属性4&\"属性\")&\"攻撃を行う\"","v":"0点の攻撃を行う"}]
[null,"斬","攻撃","メイン",1,1,2,15,5,4,0,0,8,0,0,{"$f":"威力4&\"点の\"&IF(属性4=\"無\",\"\",属性4&\"属性\")&\"攻撃を行う\"","v":"0点の攻撃を行う"},4,"対象A",{"$f":"VLOOKUP(技名!$B$25,$B$1:$P$200,$Q3,)+VLOOKUP(技名!$C$25,$B$1:$P$200,$Q3,)+VLOOKUP(技名!$D$25,$B$1:$P$200,$Q3,)+\nVLOOKUP(技名!$E$25,$B$1:$P$200,$Q3,)+VLOOKUP(技名!$F$25,$B$1:$P$200,$Q3,)+VLOOKUP(技名!$G$25,$B$1:$P$200,$Q3,)+\nVLOOKUP(技名!$H$25,$B$1:$P$200,$Q3,)+VLOOKUP(技名!$I$25,$B$1:$P$200,$Q3,)+VLOOKUP(技名!$J$25,$B$1:$P$200,$Q3,)+\nVLOOKUP(技名!$K$25,$B$1:$P$200,$Q3,)","v":0},{"$f":"IF(S3>=-5,IF(COUNTIF(技名!B18:K18,\"刹\")=0,IF(S3>=6,\"各ﾏｽ全体\",IF(S4=1,IF(S3=1,\"単体\",S3&\"体\"),IF(S4=2,S3&\"マス\",IF(S4=3,\"各ﾏｽ\"&S3&\"体\",)))),\"単体\"),\"自身\")","v":0}]
[null,"裂","攻撃","メイン",1,3,4,14,4,0,1,0,6,0,0,{"$f":"威力4&\"点の\"&IF(属性4=\"無\",\"\",属性4&\"属性\")&\"攻撃を行う\"","v":"0点の攻撃を行う"},5,"対象B",{"$f":"VLOOKUP(技名!$B$25,$B$1:$P$200,$Q4,)+VLOOKUP(技名!$C$25,$B$1:$P$200,$Q4,)+VLOOKUP(技名!$D$25,$B$1:$P$200,$Q4,)+\nVLOOKUP(技名!$E$25,$B$1:$P$200,$Q4,)+VLOOKUP(技名!$F$25,$B$1:$P$200,$Q4,)+VLOOKUP(技名!$G$25,$B$1:$P$200,$Q4,)+\nVLOOKUP(技名!$H$25,$B$1:$P$200,$Q4,)+VLOOKUP(技名!$I$25,$B$1:$P$200,$Q4,)+VLOOKUP(技名!$J$25,$B$1:$P$200,$Q4,)+\nVLOOKUP(技名!$K$25,$B$1:$P$200,$Q4,)","v":0}]
[null,"盾","カバー","判定直後",1,1,2,15,1,2,0,0,5,0,0,{"$f":"\"ダメージを肩代わりし、\"&威力4&\"点軽減\"&IF(属性4=\"無\",\"\",\" (\"&属性4&\"属性)\")","v":"ダメージを肩代わりし、0点軽減"},null,"射程",null,null,null,0,"無"]
[null,"壁","軽減","対象宣言時",1,1,4,13,6,0,1,0,1,0,0,{"$f":"\"攻撃対象を自身に変更し、\"&威力4&\"点軽減\"&IF(属性4=\"無\",\"\",\" (\"&属性4&\"属性)\")","v":"攻撃対象を自身に変更し、0点軽減"},null,"判定値",null,null,null,1,"火","火傷"]
[null,"打","攻撃","メイン",1,1,1,14,6,3,0,0,10,0,0,{"$f":"威力4&\"点の\"&IF(属性4=\"無\",\"\",属性4&\"属性\")&\"攻撃を行う\"","v":"0点の攻撃を行う"},null,"コスト",null,null,null,2,"水","拘束"]
[null,"術","攻撃","メイン",1,1,4,15,2,0,2,0,5,0,0,{"$f":"威力4&\"点の\"&IF(属性4=\"無\",\"\",属性4&\"属性\")&\"攻撃を行う\"","v":"0点の攻撃を行う"},9,"代償A",{"$f":"VLOOKUP(技名!$B$25,$B$1:$P$200,$Q8,)+VLOOKUP(技名!$C$25,$B$1:$P$200,$Q8,)+VLOOKUP(技名!$D$25,$B$1:$P$200,$Q8,)+\nVLOOKUP(技名!$E$25,$B$1:$P$200,$Q8,)+VLOOKUP(技名!$F$25,$B$1:$P$200,$Q8,)+VLOOKUP(技名!$G$25,$B$1:$P$200,$Q8,)+\nVLOOKUP(技名!$H$25,$B$1:$P$200,$Q8,)+VLOOKUP(技名!$I$25,$B$1:$P$200,$Q8,)+VLOOKUP(技名!$J$25,$B$1:$P$200,$Q8,)+\nVLOOKUP(技名!$K$25,$B$1:$P$200,$Q8,)","v":0},{"$f":"IF(AND(S8=0,S9=0),\"なし\",IF(S8=0,\"\",S8&\"AP\")&IF(AND(S8>=1,S9>=1)=TRUE,\"+\",\"\")&IF(S9=0,\"\",S9&\"BP\"))","v":"なし"},null,3,"雷","麻痺"]
[null,"砲","攻撃","メイン",1,2,3,12,4,4,0,0,10,0,0,{"$f":"威力4&\"点の\"&IF(属性4=\"無\",\"\",属性4&\"属性\")&\"攻撃を行う\"","v":"0点の攻撃を行う"},10,"代償B",{"$f":"VLOOKUP(技名!$B$25,$B$1:$P$200,$Q9,)+VLOOKUP(技名!$C$25,$B$1:$P$200,$Q9,)+VLOOKUP(技名!$D$25,$B$1:$P$200,$Q9,)+\nVLOOKUP(技名!$E$25,$B$1:$P$200,$Q9,)+VLOOKUP(技名!$F$25,$B$1:$P$200,$Q9,)+VLOOKUP(技名!$G$25,$B$1:$P$200,$Q9,)+\nVLOOKUP(技名!$H$25,$B$1:$P$200,$Q9,)+VLOOKUP(技名!$I$25,$B$1:$P$200,$Q9,)+VLOOKUP(技名!$J$25,$B$1:$P$200,$Q9,)+\nVLOOKUP(技名!$K$25,$B$1:$P$200,$Q9,)","v":0},null,null,4,"地","石化"]
[null,"蘇","回復","メイン",1,1,1,12,2,0,1,0,1,0,0,{"$f":"\"戦闘不能を解除し、HPを\"&威力4&\"点回復\"","v":"戦闘不能を解除し、HPを0点回復"},11,"属性",{"$f":"MAX(VLOOKUP(技名!$B$25,$B$1:$P$200,$Q10,),VLOOKUP(技名!$C$25,$B$1:$P$200,$Q10,),VLOOKUP(技名!$D$25,$B$1:$P$200,$Q10,),\nVLOOKUP(技名!$E$25,$B$1:$P$200,$Q10,),VLOOKUP(技名!$F$25,$B$1:$P$200,$Q10,),VLOOKUP(技名!$G$25,$B$1:$P$200,$Q10,),\nVLOOKUP(技名!$H$25,$B$1:$P$200,$Q10,),VLOOKUP(技名!$I$25,$B$1:$P$200,$Q10,),VLOOKUP(技名!$J$25,$B$1:$P$200,$Q10,),\nVLOOKUP(技名!$K$25,$B$1:$P$200,$Q10,))","v":0},{"$f":"VLOOKUP(S10,V5:W13,2,)","v":"無"},null,5,"風","封印"]
{"$rows_left_out":167}