{"text_format":"1","workbook":"xlsx","n_sheets":7,"sheets":["CS","コピペ用","便利表1","クリアボタン","atwiki","VL用","武器用"],"not_rendered":{"charts":0,"images":0,"macros":1,"external_links":0,"defined_names":12,"comments":0,"pivot_tables":0},"unopened":[],"bounds":{"document_bytes":16777216,"sheet_cells":100000,"rows_first":2000,"rows_last":500,"rows_between":2000,"halvings":0,"cell_chars":16384,"cell_head_chars":4096},"cells_cut":0,"cells_raw":0,"read":"whole","date_system":"1900"}

{"sheet":"CS","index":0,"n_rows":54,"n_cols":80,"rows_kept":54,"cut":false,"hidden":false,"merged":[[14,51,15,55],[16,51,17,55],[14,56,15,59],[17,18,17,20],[17,21,17,24],[17,25,17,27],[17,28,17,31],[17,32,17,34],[17,35,17,38],[15,32,16,34],[15,35,16,38],[15,21,16,29],[15,30,15,31],[16,30,16,31],[14,42,15,46],[14,47,15,50],[16,56,17,59],[18,18,18,20],[16,47,17,50],[31,69,32,79],[27,69,28,79],[29,69,30,79],[27,64,28,65],[27,66,28,68],[29,64,30,65],[29,66,30,68],[27,42,28,42],[29,42,30,42],[29,43,30,49],[29,57,30,58],[23,21,23,22],[21,56,22,73],[21,74,22,79],[29,61,30,63],[29,50,30,51],[29,59,30,60],[26,28,27,29],[30,28,31,29],[21,17,22,22],[23,56,24,67],[25,56,26,67],[18,21,18,38],[39,69,40,79],[39,66,40,68],[39,64,40,65],[25,68,26,79],[21,42,22,55],[27,57,28,58],[27,61,28,63],[27,59,28,60],[34,28,35,29],[18,42,19,46],[27,50,28,51],[27,52,28,53],[27,43,28,49],[31,42,32,42],[23,42,24,55],[25,42,26,55],[29,52,30,53],[29,54,30,56],[31,52,32,53],[39,61,40,63],[35,54,36,56],[23,68,24,79],[27,54,28,56],[33,50,34,51],[41,52,42,53],[47,54,48,56],[33,52,34,53],[33,54,34,56],[39,57,40,58],[39,52,40,53],[35,43,36,49],[43,50,44,51],[39,43,40,49],[37,50,38,51],[47,43,48,49],[43,52,44,53],[33,43,34,49],[35,52,36,53],[41,43,42,49],[39,54,40,56],[39,50,40,51],[35,50,36,51],[41,57,42,58],[43,43,44,49],[37,54,38,56],[53,69,54,79],[33,59,34,60],[33,61,34,63],[35,69,36,79],[33,66,34,68],[47,61,48,63],[47,59,48,60],[51,69,52,79],[49,61,50,63],[53,59,54,60],[53,61,54,63],[53,64,54,65],[53,66,54,68],[35,61,36,63],[35,64,36,65],[35,59,36,60],[45,66,46,68],[49,69,50,79],[47,69,48,79],[37,69,38,79],[41,69,42,79],[43,64,44,65],[41,66,42,68],[39,59,40,60],[43,69,44,79],[43,66,44,68],[51,64,52,65],[33,69,34,79],[37,64,38,65],[33,64,34,65],[47,66,48,68],[45,69,46,79],[45,64,46,65],[51,66,52,68],[31,66,32,68],[47,64,48,65],[31,64,32,65],[49,66,50,68],[31,57,32,58],[45,57,46,58],[43,59,44,60],[33,57,34,58],[45,61,46,63],[37,61,38,63],[35,57,36,58],[45,59,46,60],[47,57,48,58],[49,59,50,60],[37,59,38,60],[31,59,32,60],[31,61,32,63],[37,57,38,58],[41,64,42,65],[49,64,50,65],[35,66,36,68],[37,66,38,68],[41,61,42,63],[41,59,42,60],[51,59,52,60],[51,57,52,58],[51,61,52,63],[43,61,44,63],[43,57,44,58],[53,57,54,58],[51,42,52,42],[49,52,50,53],[49,50,50,51],[49,57,50,58],[51,43,52,49],[47,52,48,53],[43,42,44,42],[51,52,52,53],[31,54,32,56],[47,50,48,51],[49,43,50,49],[53,42,54,42],[31,50,32,51],[37,43,38,49],[49,54,50,56],[53,43,54,49],[53,50,54,51],[53,52,54,53],[53,54,54,56],[37,52,38,53],[45,43,46,49],[45,50,46,51],[45,52,46,53],[51,54,52,56],[51,50,52,51],[45,54,46,56],[41,54,42,56],[49,42,50,42],[47,42,48,42],[45,42,46,42],[41,50,42,51],[43,54,44,56],[33,42,34,42],[42,23,43,27],[42,31,43,33],[32,34,33,37],[32,31,33,33],[38,34,39,37],[34,34,35,37],[37,42,38,42],[39,42,40,42],[41,42,42,42],[32,23,33,27],[34,23,35,27],[36,23,37,27],[38,23,39,27],[36,31,37,33],[38,31,39,33],[34,31,35,33],[38,28,39,29],[42,28,43,29],[53,17,53,18],[53,19,53,20],[53,21,53,22],[48,17,48,18],[46,19,46,20],[48,19,48,20],[48,21,48,22],[49,14,49,16],[47,21,47,22],[52,17,52,18],[52,19,52,20],[52,21,52,22],[50,17,50,18],[49,17,49,18],[51,14,51,16],[51,17,51,18],[46,14,46,16],[50,21,50,22],[49,21,49,22],[31,43,32,49],[36,19,37,20],[38,17,39,18],[44,34,44,37],[46,23,46,27],[42,34,43,37],[45,21,45,22],[40,23,41,27],[40,34,41,37],[46,17,46,18],[46,31,46,33],[40,31,41,33],[38,21,39,22],[42,21,43,22],[40,21,41,22],[46,21,46,22],[44,21,44,22],[35,42,36,42],[34,21,35,22],[36,34,37,37],[44,30,53,30],[44,31,44,33],[45,34,45,37],[50,28,51,29],[45,23,45,27],[51,19,51,20],[50,19,50,20],[49,19,49,20],[47,19,47,20],[51,21,51,22],[44,23,44,27],[45,31,45,33],[47,31,47,33],[49,31,49,33],[53,31,53,33],[50,34,50,37],[50,31,50,33],[48,31,48,33],[47,23,47,27],[51,31,51,33],[52,31,52,33],[53,34,53,37],[52,34,52,37],[50,23,50,27],[51,23,51,27],[49,34,49,37],[49,23,49,27],[51,34,51,37],[48,23,48,27],[48,34,48,37],[46,28,47,29],[52,23,52,27],[53,23,53,27],[47,34,47,37],[46,34,46,37],[38,2,39,4],[38,5,39,7],[45,17,45,18],[44,14,44,16],[45,14,45,16],[40,17,41,18],[48,14,48,16],[38,19,39,20],[40,19,41,20],[40,11,41,13],[48,3,48,4],[47,8,47,10],[42,11,43,13],[44,11,44,13],[42,8,43,10],[44,19,44,20],[42,19,43,20],[45,11,45,13],[45,19,45,20],[47,14,47,16],[47,17,47,18],[44,17,44,18],[40,14,41,16],[36,2,37,4],[36,5,37,7],[36,8,37,10],[42,2,43,4],[44,2,53,2],[46,3,46,4],[46,5,46,7],[42,5,43,7],[51,8,51,10],[47,5,47,7],[53,3,53,4],[53,5,53,7],[53,8,53,10],[44,8,44,10],[40,8,41,10],[44,5,44,7],[44,3,44,4],[45,3,45,4],[45,8,45,10],[45,5,45,7],[52,3,52,4],[52,5,52,7],[49,3,49,4],[49,5,49,7],[49,8,49,10],[42,17,43,18],[42,14,43,16],[52,14,52,16],[50,14,50,16],[49,11,49,13],[53,11,53,13],[47,3,47,4],[46,8,46,10],[50,8,50,10],[51,3,51,4],[51,11,51,13],[52,11,52,13],[51,5,51,7],[46,11,46,13],[50,11,50,13],[48,11,48,13],[52,8,52,10],[50,3,50,4],[50,5,50,7],[47,11,47,13],[48,5,48,7],[48,8,48,10],[53,14,53,16],[36,11,37,13],[24,31,25,33],[24,34,25,37],[32,19,33,20],[32,17,33,18],[32,21,33,22],[34,19,35,20],[36,14,37,16],[30,34,31,37],[24,23,25,27],[34,11,35,13],[34,17,35,18],[36,21,37,22],[26,31,27,33],[26,23,27,27],[26,21,27,22],[24,21,25,22],[28,31,29,33],[30,19,31,20],[30,21,31,22],[30,23,31,27],[30,31,31,33],[28,34,29,37],[36,17,37,18],[21,2,23,4],[21,5,22,7],[21,8,22,10],[21,11,23,13],[21,14,23,16],[40,2,41,4],[40,5,41,7],[38,8,39,10],[38,11,39,13],[38,14,39,16],[34,14,35,16],[32,2,33,4],[32,5,33,7],[32,8,33,10],[32,11,33,13],[32,14,33,16],[34,2,35,4],[34,5,35,7],[34,8,35,10],[28,2,29,4],[28,5,29,7],[28,8,29,10],[30,2,31,4],[26,2,27,4],[26,5,27,7],[26,8,27,10],[26,11,27,13],[26,14,27,16],[26,17,27,18],[26,19,27,20],[23,5,23,7],[23,8,23,10],[23,17,23,18],[23,19,23,20],[24,8,25,10],[24,11,25,13],[24,14,25,16],[24,17,25,18],[24,19,25,20],[17,13,18,15],[18,47,19,50],[18,51,19,55],[19,1,20,38],[20,42,20,79],[18,56,19,58],[18,59,19,59],[16,42,17,46],[30,5,31,7],[30,8,31,10],[30,11,31,13],[30,17,31,18],[30,14,31,16],[21,23,23,27],[21,28,23,38],[24,2,25,4],[26,34,27,37],[28,11,29,13],[28,14,29,16],[28,17,29,18],[28,19,29,20],[28,21,29,22],[28,23,29,27],[24,5,25,7],[9,1,10,7],[9,16,10,17],[9,18,10,20],[9,21,10,24],[9,25,10,29],[9,30,9,33],[16,1,16,3],[16,4,16,6],[16,7,16,9],[16,10,16,12],[16,13,16,15],[13,16,18,17],[13,18,14,38],[14,1,15,3],[14,4,15,6],[14,7,15,9],[14,10,15,12],[14,13,15,15],[15,18,16,20],[13,1,13,15],[17,1,18,3],[17,4,18,6],[17,7,18,9],[17,10,18,12],[11,1,12,7],[11,8,12,13],[11,14,12,14],[11,15,12,20],[11,21,12,24],[11,25,12,29],[11,57,11,79],[12,42,13,46],[12,47,13,50],[12,51,13,55],[12,56,13,59],[12,62,12,79],[13,62,13,79],[9,34,10,38],[9,42,9,55],[9,8,10,12],[9,13,9,15],[10,13,10,15],[5,57,6,60],[5,61,6,71],[7,9,8,12],[7,21,8,24],[7,25,8,29],[7,30,7,33],[7,34,8,38],[7,42,8,45],[7,46,8,56],[7,57,8,60],[7,61,8,71],[8,30,8,33],[9,56,11,56],[9,57,10,60],[9,61,10,71],[10,30,10,33],[10,42,11,55],[11,30,12,33],[11,34,12,38],[1,1,4,2],[1,3,4,10],[1,14,4,16],[1,21,1,38],[1,42,2,56],[1,57,2,71],[1,72,10,79],[2,21,2,29],[2,30,2,38],[3,17,4,20],[3,21,4,29],[3,30,4,38],[3,42,4,45],[3,46,4,56],[3,57,4,60],[3,61,4,71],[5,1,5,2],[5,3,8,4],[5,13,6,16],[5,17,8,19],[5,21,6,29],[5,30,6,38],[5,42,6,45],[5,46,6,56],[14,62,14,79],[15,62,15,79],[17,62,17,70],[18,62,18,70],[19,62,19,70],[17,71,17,79],[18,71,18,79],[19,71,19,79],[16,62,16,65],[16,74,16,78],[16,69,16,73]]}
[]
[null,null,null,null,null,null,null,null,null,null,null,null,null,null,null,null,null,null,null,null,null,null,null,null,null,null,null,null,null,null,null,null,null,null,null,null,null,null,null,null,null,null,"Lifepath",null,null,null,null,null,null,null,null,null,null,null,null,null,null,"Equipment's name",null,null,null,null,null,null,null,null,null,null,null,null,null,null,"Illust"]
[null,null,null,null,null,null,null,null,null,null,null,null,null,null,null,null,null,null,null,null,null,"Character's name",null,null,null,null,null,null,null,null,"Player's name"]
[null,null,null,null,null,null,null,null,null,null,null,null,null,null,null,null,null,null,null,null,null,null,null,null,null,null,null,null,null,null,null,null,null,null,null,null,null,null,null,null,null,null,"理由",null,null,null,null,null,null,null,null,null,null,null,null,null,null,"防具",null,null,null,"一般服"]
[]
[null,null,null,null,null,null,null,null,null,null,null,null,null,null,null,null,null,null,null,null,null,"Experience Points",null,null,null,null,null,null,null,null,null,null,null,null,null,null,null,null,null,null,null,null,"職業",null,null,null,null,null,null,null,null,null,null,null,null,null,null,"アクセA",null,null,null,"なし"]
[]
[null,null,null,null,null,null,null,null,null,null,null,null,null,null,null,null,null,null,null,null,null,"Age",null,null,null,null,null,null,null,null,"Hair",null,null,null,null,null,null,null,null,null,null,null,"宝物",null,null,null,null,null,null,null,null,null,null,null,null,null,null,"アクセB",null,null,null,"なし"]
[null,null,null,null,null,null,null,null,null,null,null,null,null,null,null,null,null,null,null,null,null,null,null,null,null,null,null,null,null,null,"Color"]
[null,"Species",null,null,null,null,null,null,"人間",null,null,null,null,null,null,null,"CL",null,1,null,null,"Height",null,null,null,null,null,null,null,null,"Eye",null,null,null,null,null,null,null,null,null,null,null,null,null,null,null,null,null,null,null,null,null,null,null,null,null,null,"アクセC",null,null,null,"なし"]
[null,null,null,null,null,null,null,null,null,null,null,null,null,null,null,null,null,null,null,null,null,null,null,null,null,null,null,null,null,null,"Color",null,null,null,null,null,null,null,null,null,null,null,"Other Data"]
[null,"Class",null,null,null,null,null,null,"FS",null,null,null,null,null,"/","FC",null,null,null,null,null,"Weight",null,null,null,null,null,null,null,null,"Complexion"]
[null,null,null,null,null,null,null,null,null,null,null,null,null,null,null,null,null,null,null,null,null,null,null,null,null,null,null,null,null,null,null,null,null,null,null,null,null,null,null,null,null,null,"命中C値",null,null,null,null,18,null,null,null,"命中F値",null,null,null,null,5]
[null,"基本能力値",null,null,null,null,null,null,null,null,null,null,null,null,null,null,null,null,"武器性能"]
[null,"肉体",null,null,"集中",null,null,"反射",null,null,"知識",null,null,"幸運",null,null,null,null,null,null,null,null,null,null,null,null,null,null,null,null,null,null,null,null,null,null,null,null,null,null,null,null,"回避C値",null,null,null,null,18,null,null,null,"回避F値",null,null,null,null,5]
[null,null,null,null,null,null,null,null,null,null,null,null,null,null,null,null,null,null,"名称",null,null,"素手",null,null,null,null,null,null,null,null,"SL",null,"種別",null,null,{"$f":"VLOOKUP(武器名,武器用!B2:AD214,24,FALSE)","v":"近接"}]
[null,{"$f":"VLOOKUP(種族名,VL用!$A$2:$F$25,2,FALSE)+S10-1","v":6},null,null,{"$f":"VLOOKUP(種族名,VL用!$A$2:$F$25,3,FALSE)+S10-1","v":12},null,null,{"$f":"VLOOKUP(種族名,VL用!$A$2:$F$25,4,FALSE)+S10-1","v":7},null,null,{"$f":"VLOOKUP(種族名,VL用!$A$2:$F$25,5,FALSE)+S10-1","v":8},null,null,{"$f":"VLOOKUP(種族名,VL用!$A$2:$F$25,6,FALSE)+S10-1","v":8},null,null,null,null,null,null,null,null,null,null,null,null,null,null,null,null,null,null,null,null,null,null,null,null,null,null,null,null,"調査C値",null,null,null,null,18,null,null,null,"調査F値",null,null,null,null,5,null,null,null,null,null,"所持品",null,null,null,null,null,null,"所持金→",null,null,null,null,null,null,null,null,null,"ND"]
[null,null,null,null,null,null,null,null,null,null,null,null,null,null,null,null,null,null,"射程",null,null,{"$f":"VLOOKUP(武器名,武器用!B2:AD214,25,FALSE)","v":"0-1"},null,null,null,"コスト",null,null,{"$f":"VLOOKUP(武器名,武器用!B2:AD214,27,FALSE)","v":9},null,null,null,"属性",null,null,{"$f":"VLOOKUP(武器名,武器用!B2:AD214,26,FALSE)","v":"近"}]
[null,null,null,null,null,null,null,null,null,null,null,null,null,null,null,null,null,null,"効果",null,null,{"$f":"VLOOKUP(武器名,武器用!B2:AD214,28,FALSE)","v":"効果なし"},null,null,null,null,null,null,null,null,null,null,null,null,null,null,null,null,null,null,null,null,"移動ｺｽﾄ",null,null,null,null,"3/8",null,null,null,"消費額",null,null,null,null,{"$f":"VLOOKUP(武器名,VL用!$AM$55:$BN$558,28,FALSE)+VLOOKUP(防具名,VL用!$BO$55:$CL$506,24,FALSE)+VLOOKUP(アクセA,VL用!$CM$55:$DJ$515,24,FALSE)+VLOOKUP(アクセB,VL用!$CM$55:$DJ$515,24,FALSE)+VLOOKUP(アクセC,VL用!$CM$55:$DJ$515,24,FALSE)","v":0},null,null,"ND"]
[null,"Status               　　                     　"]
[]
[null,null,null,null,null,"種族",null,null,"ｸﾗｽ",null,null,"武器",null,null,"防具",null,null,"ｱｸｾｻﾘｰ",null,null,null,null,null,"他修正",null,null,null,null,"Total status",null,null,null,null,null,null,null,null,null,null,null,null,null,"Skill            ",null,null,null,null,null,null,null,null,null,null,null,null,null,"現在のSL合計/SL合計上限",null,null,null,null,null,null,null,null,null,null,null,null,null,null,null,null,null,{"$f":"SUM($AY$31:$AZ$55)&\"/\"&S10*5+15","v":"0/20"}]
[]
[null,null,null,null,null,"Bonus",null,null,"Bonus",null,null,null,null,null,null,null,null,"A",null,"B",null,"C",null,null,null,null,null,null,null,null,null,null,null,null,null,null,null,null,null,null,null,null,"種族特典",null,null,null,null,null,null,null,null,null,null,null,null,null,"クラス特典A",null,null,null,null,null,null,null,null,null,null,null,"クラス特典B"]
[null,null,"近接",null,null,{"$f":"IF($S$10=1,VLOOKUP(種族名,VL用!$F$27:$Z$51,VL用!$B27,FALSE),IF($S$10=2,VLOOKUP(種族名,VL用!$AA$27:$AU51,VL用!$B27,FALSE),IF($S$10=3,VLOOKUP(種族名,VL用!$AV$27:$BP$51,VL用!$B27,FALSE),IF($S$10=4,VLOOKUP(種族名,VL用!$BQ$27:$CK$51,VL用!$B27,FALSE),IF($S$10=5,VLOOKUP(種族名,VL用!$CL$27:$DF$51,VL用!$B27,FALSE),IF($S$10=6,VLOOKUP(種族名,VL用!$DG$27:$EA$51,VL用!$B27,FALSE),IF($S$10=7,VLOOKUP(種族名,VL用!$EB$27:$EV$51,VL用!$B27,FALSE),IF($S$10=8,VLOOKUP(種族名,VL用!$EW$27:$FQ$51,VL用!$B27,FALSE),IF($S$10=9,VLOOKUP(種族名,VL用!$FR$27:$GL$51,VL用!$B27,FALSE),IF($S$10=10,VLOOKUP(種族名,VL用!$GM$27:$HG$51,VL用!$B27,FALSE)))))))))))","v":5},null,null,{"$f":"VLOOKUP(クラスA,VL用!$F$54:$P$100,VL用!$B27,FALSE)+VLOOKUP(クラスB,VL用!$F$54:$P$100,VL用!$B27,FALSE)","v":4},null,null,{"$f":"IF(VLOOKUP(武器名,VL用!$AM$55:$BM$267,VL用!$DK54,FALSE)&\"\"=\"\",\"\",VALUE(VLOOKUP(武器名,VL用!$AM$55:$BM$267,VL用!$DK54,FALSE)))","v":-2},null,null,{"$f":"IF(VLOOKUP(防具名,VL用!$BO$55:$CK$168,VL用!$DK54,FALSE)&\"\"=\"\",\"\",VALUE(VLOOKUP(防具名,VL用!$BO$55:$CK$168,VL用!$DK54,FALSE)))","v":""},null,null,{"$f":"IF(VLOOKUP(アクセA,VL用!$CM$55:$DI$278,VL用!$DK54,FALSE)&\"\"=\"\",\"\",VALUE(VLOOKUP(アクセA,VL用!$CM$55:$DI$278,VL用!$DK54,FALSE)))","v":""},null,{"$f":"IF(VLOOKUP(アクセB,VL用!$CM$55:$DI$278,VL用!$DK54,FALSE)&\"\"=\"\",\"\",VALUE(VLOOKUP(アクセB,VL用!$CM$55:$DI$278,VL用!$DK54,FALSE)))","v":""},null,{"$f":"IF(VLOOKUP(アクセC,VL用!$CM$55:$DI$278,VL用!$DK54,FALSE)&\"\"=\"\",\"\",VALUE(VLOOKUP(アクセC,VL用!$CM$55:$DI$278,VL用!$DK54,FALSE)))","v":""},null,null,null,null,null,null,null,null,null,"近接",null,null,{"$f":"SUM(F25:AB26)","v":7}]
[null,null,null,null,null,null,null,null,null,null,null,null,null,null,null,null,null,null,null,null,null,null,null,null,null,null,null,null,null,null,null,null,null,null,null,null,null,null,null,null,null,null,{"$f":"VLOOKUP(種族名,VL用!$A$2:$G$25,7,FALSE)","v":"常時C値-1(下限値16) & 集中判定を1度振り直せる。"},null,null,null,null,null,null,null,null,null,null,null,null,null,{"$f":"VLOOKUP(クラスA,VL用!$F$54:$AA$93,22,FALSE)","v":"命中判定のC値-1 F値+1 & 炎氷耐性+3"},null,null,null,null,null,null,null,null,null,null,null,{"$f":"IF(クラスA=クラスB,\"なし\",VLOOKUP(クラスB,VL用!$F$54:$AA$100,22,FALSE))","v":"氷水雷風土耐性+2 & 「BS：凍結」無効"}]
[null,null,"射撃",null,null,{"$f":"IF($S$10=1,VLOOKUP(種族名,VL用!$F$27:$Z$51,VL用!$B29,FALSE),IF($S$10=2,VLOOKUP(種族名,VL用!$AA$27:$AU53,VL用!$B29,FALSE),IF($S$10=3,VLOOKUP(種族名,VL用!$AV$27:$BP$51,VL用!$B29,FALSE),IF($S$10=4,VLOOKUP(種族名,VL用!$BQ$27:$CK$51,VL用!$B29,FALSE),IF($S$10=5,VLOOKUP(種族名,VL用!$CL$27:$DF$51,VL用!$B29,FALSE),IF($S$10=6,VLOOKUP(種族名,VL用!$DG$27:$EA$51,VL用!$B29,FALSE),IF($S$10=7,VLOOKUP(種族名,VL用!$EB$27:$EV$51,VL用!$B29,FALSE),IF($S$10=8,VLOOKUP(種族名,VL用!$EW$27:$FQ$51,VL用!$B29,FALSE),IF($S$10=9,VLOOKUP(種族名,VL用!$FR$27:$GL$51,VL用!$B29,FALSE),IF($S$10=10,VLOOKUP(種族名,VL用!$GM$27:$HG$51,VL用!$B29,FALSE)))))))))))","v":5},null,null,{"$f":"VLOOKUP(クラスA,VL用!$F$54:$P$100,VL用!$B29,FALSE)+VLOOKUP(クラスB,VL用!$F$54:$P$100,VL用!$B29,FALSE)","v":4},null,null,{"$f":"IF(VLOOKUP(武器名,VL用!$AM$55:$BM$267,VL用!$DK56,FALSE)&\"\"=\"\",\"\",VALUE(VLOOKUP(武器名,VL用!$AM$55:$BM$267,VL用!$DK56,FALSE)))","v":""},null,null,{"$f":"IF(VLOOKUP(防具名,VL用!$BO$55:$CK$168,VL用!$DK56,FALSE)&\"\"=\"\",\"\",VALUE(VLOOKUP(防具名,VL用!$BO$55:$CK$168,VL用!$DK56,FALSE)))","v":""},null,null,{"$f":"IF(VLOOKUP(アクセA,VL用!$CM$55:$DI$278,VL用!$DK56,FALSE)&\"\"=\"\",\"\",VALUE(VLOOKUP(アクセA,VL用!$CM$55:$DI$278,VL用!$DK56,FALSE)))","v":""},null,{"$f":"IF(VLOOKUP(アクセB,VL用!$CM$55:$DI$278,VL用!$DK56,FALSE)&\"\"=\"\",\"\",VALUE(VLOOKUP(アクセB,VL用!$CM$55:$DI$278,VL用!$DK56,FALSE)))","v":""},null,{"$f":"IF(VLOOKUP(アクセC,VL用!$CM$55:$DI$278,VL用!$DK56,FALSE)&\"\"=\"\",\"\",VALUE(VLOOKUP(アクセC,VL用!$CM$55:$DI$278,VL用!$DK56,FALSE)))","v":""},null,null,null,null,null,null,null,null,null,"射撃",null,null,{"$f":"SUM(F27:AB28)","v":9}]
[null,null,null,null,null,null,null,null,null,null,null,null,null,null,null,null,null,null,null,null,null,null,null,null,null,null,null,null,null,null,null,null,null,null,null,null,null,null,null,null,null,null,null,"名称",null,null,null,null,null,null,"SL",null,"種別",null,"ﾀｲﾐﾝｸﾞ",null,null,"対象",null,"射程",null,"判定値",null,null,"代償",null,"コスト",null,null,"効果"]
[null,null,"回避",null,null,{"$f":"IF($S$10=1,VLOOKUP(種族名,VL用!$F$27:$Z$51,VL用!$B31,FALSE),IF($S$10=2,VLOOKUP(種族名,VL用!$AA$27:$AU55,VL用!$B31,FALSE),IF($S$10=3,VLOOKUP(種族名,VL用!$AV$27:$BP$51,VL用!$B31,FALSE),IF($S$10=4,VLOOKUP(種族名,VL用!$BQ$27:$CK$51,VL用!$B31,FALSE),IF($S$10=5,VLOOKUP(種族名,VL用!$CL$27:$DF$51,VL用!$B31,FALSE),IF($S$10=6,VLOOKUP(種族名,VL用!$DG$27:$EA$51,VL用!$B31,FALSE),IF($S$10=7,VLOOKUP(種族名,VL用!$EB$27:$EV$51,VL用!$B31,FALSE),IF($S$10=8,VLOOKUP(種族名,VL用!$EW$27:$FQ$51,VL用!$B31,FALSE),IF($S$10=9,VLOOKUP(種族名,VL用!$FR$27:$GL$51,VL用!$B31,FALSE),IF($S$10=10,VLOOKUP(種族名,VL用!$GM$27:$HG$51,VL用!$B31,FALSE)))))))))))","v":3},null,null,{"$f":"VLOOKUP(クラスA,VL用!$F$54:$P$100,VL用!$B31,FALSE)+VLOOKUP(クラスB,VL用!$F$54:$P$100,VL用!$B31,FALSE)","v":3},null,null,{"$f":"IF(VLOOKUP(武器名,VL用!$AM$55:$BM$267,VL用!$DK58,FALSE)&\"\"=\"\",\"\",VALUE(VLOOKUP(武器名,VL用!$AM$55:$BM$267,VL用!$DK58,FALSE)))","v":""},null,null,{"$f":"IF(VLOOKUP(防具名,VL用!$BO$55:$CK$168,VL用!$DK58,FALSE)&\"\"=\"\",\"\",VALUE(VLOOKUP(防具名,VL用!$BO$55:$CK$168,VL用!$DK58,FALSE)))","v":""},null,null,{"$f":"IF(VLOOKUP(アクセA,VL用!$CM$55:$DI$278,VL用!$DK58,FALSE)&\"\"=\"\",\"\",VALUE(VLOOKUP(アクセA,VL用!$CM$55:$DI$278,VL用!$DK58,FALSE)))","v":""},null,{"$f":"IF(VLOOKUP(アクセB,VL用!$CM$55:$DI$278,VL用!$DK58,FALSE)&\"\"=\"\",\"\",VALUE(VLOOKUP(アクセB,VL用!$CM$55:$DI$278,VL用!$DK58,FALSE)))","v":""},null,{"$f":"IF(VLOOKUP(アクセC,VL用!$CM$55:$DI$278,VL用!$DK58,FALSE)&\"\"=\"\",\"\",VALUE(VLOOKUP(アクセC,VL用!$CM$55:$DI$278,VL用!$DK58,FALSE)))","v":""},null,null,null,null,null,null,null,null,null,"回避",null,null,{"$f":"SUM(F29:AB30)","v":6}]
[null,null,null,null,null,null,null,null,null,null,null,null,null,null,null,null,null,null,null,null,null,null,null,null,null,null,null,null,null,null,null,null,null,null,null,null,null,null,null,null,null,null,"自",{"$f":"VLOOKUP(種族名,VL用!$A$2:$AN$25,17,FALSE)","v":"起死回生"},null,null,null,null,null,null,{"$f":"VLOOKUP(種族名,VL用!$A$2:$AN$25,20,FALSE)","v":"★"},null,{"$f":"VLOOKUP(種族名,VL用!$A$2:$AN$25,21,FALSE)","v":"自"},null,{"$f":"VLOOKUP(種族名,VL用!$A$2:$AN$25,22,FALSE)","v":"ｵｰﾄ"},null,null,{"$f":"VLOOKUP(種族名,VL用!$A$2:$AN$25,23,FALSE)","v":"自"},null,{"$f":"VLOOKUP(種族名,VL用!$A$2:$AN$25,24,FALSE)","v":"なし"},null,{"$f":"VLOOKUP(種族名,VL用!$A$2:$AN$25,25,FALSE)","v":"自動"},null,null,{"$f":"VLOOKUP(種族名,VL用!$A$2:$AN$25,26,FALSE)","v":"6BP"},null,{"$f":"VLOOKUP(種族名,VL用!$A$2:$AN$25,27,FALSE)","v":0},null,null,{"$f":"VLOOKUP(種族名,VL用!$A$2:$AN$25,28,FALSE)","v":"判定直後ダイス目を両方9にする。対抗判定のC値が20固定。戦闘外では-2BP。"}]
[null,null,"魔術",null,null,{"$f":"IF($S$10=1,VLOOKUP(種族名,VL用!$F$27:$Z$51,VL用!$B33,FALSE),IF($S$10=2,VLOOKUP(種族名,VL用!$AA$27:$AU57,VL用!$B33,FALSE),IF($S$10=3,VLOOKUP(種族名,VL用!$AV$27:$BP$51,VL用!$B33,FALSE),IF($S$10=4,VLOOKUP(種族名,VL用!$BQ$27:$CK$51,VL用!$B33,FALSE),IF($S$10=5,VLOOKUP(種族名,VL用!$CL$27:$DF$51,VL用!$B33,FALSE),IF($S$10=6,VLOOKUP(種族名,VL用!$DG$27:$EA$51,VL用!$B33,FALSE),IF($S$10=7,VLOOKUP(種族名,VL用!$EB$27:$EV$51,VL用!$B33,FALSE),IF($S$10=8,VLOOKUP(種族名,VL用!$EW$27:$FQ$51,VL用!$B33,FALSE),IF($S$10=9,VLOOKUP(種族名,VL用!$FR$27:$GL$51,VL用!$B33,FALSE),IF($S$10=10,VLOOKUP(種族名,VL用!$GM$27:$HG$51,VL用!$B33,FALSE)))))))))))","v":4},null,null,{"$f":"VLOOKUP(クラスA,VL用!$F$54:$P$100,VL用!$B33,FALSE)+VLOOKUP(クラスB,VL用!$F$54:$P$100,VL用!$B33,FALSE)","v":4},null,null,{"$f":"IF(VLOOKUP(武器名,VL用!$AM$55:$BM$267,VL用!$DK60,FALSE)&\"\"=\"\",\"\",VALUE(VLOOKUP(武器名,VL用!$AM$55:$BM$267,VL用!$DK60,FALSE)))","v":""},null,null,{"$f":"IF(VLOOKUP(防具名,VL用!$BO$55:$CK$168,VL用!$DK60,FALSE)&\"\"=\"\",\"\",VALUE(VLOOKUP(防具名,VL用!$BO$55:$CK$168,VL用!$DK60,FALSE)))","v":""},null,null,{"$f":"IF(VLOOKUP(アクセA,VL用!$CM$55:$DI$278,VL用!$DK60,FALSE)&\"\"=\"\",\"\",VALUE(VLOOKUP(アクセA,VL用!$CM$55:$DI$278,VL用!$DK60,FALSE)))","v":""},null,{"$f":"IF(VLOOKUP(アクセB,VL用!$CM$55:$DI$278,VL用!$DK60,FALSE)&\"\"=\"\",\"\",VALUE(VLOOKUP(アクセB,VL用!$CM$55:$DI$278,VL用!$DK60,FALSE)))","v":""},null,{"$f":"IF(VLOOKUP(アクセC,VL用!$CM$55:$DI$278,VL用!$DK60,FALSE)&\"\"=\"\",\"\",VALUE(VLOOKUP(アクセC,VL用!$CM$55:$DI$278,VL用!$DK60,FALSE)))","v":""},null,null,null,null,null,null,null,null,null,"魔術",null,null,{"$f":"SUM(F31:AB32)","v":8}]
[null,null,null,null,null,null,null,null,null,null,null,null,null,null,null,null,null,null,null,null,null,null,null,null,null,null,null,null,null,null,null,null,null,null,null,null,null,null,null,null,null,null,1]
[null,null,"抵抗",null,null,{"$f":"IF($S$10=1,VLOOKUP(種族名,VL用!$F$27:$Z$51,VL用!$B35,FALSE),IF($S$10=2,VLOOKUP(種族名,VL用!$AA$27:$AU59,VL用!$B35,FALSE),IF($S$10=3,VLOOKUP(種族名,VL用!$AV$27:$BP$51,VL用!$B35,FALSE),IF($S$10=4,VLOOKUP(種族名,VL用!$BQ$27:$CK$51,VL用!$B35,FALSE),IF($S$10=5,VLOOKUP(種族名,VL用!$CL$27:$DF$51,VL用!$B35,FALSE),IF($S$10=6,VLOOKUP(種族名,VL用!$DG$27:$EA$51,VL用!$B35,FALSE),IF($S$10=7,VLOOKUP(種族名,VL用!$EB$27:$EV$51,VL用!$B35,FALSE),IF($S$10=8,VLOOKUP(種族名,VL用!$EW$27:$FQ$51,VL用!$B35,FALSE),IF($S$10=9,VLOOKUP(種族名,VL用!$FR$27:$GL$51,VL用!$B35,FALSE),IF($S$10=10,VLOOKUP(種族名,VL用!$GM$27:$HG$51,VL用!$B35,FALSE)))))))))))","v":3},null,null,{"$f":"VLOOKUP(クラスA,VL用!$F$54:$P$100,VL用!$B35,FALSE)+VLOOKUP(クラスB,VL用!$F$54:$P$100,VL用!$B35,FALSE)","v":2},null,null,{"$f":"IF(VLOOKUP(武器名,VL用!$AM$55:$BM$267,VL用!$DK62,FALSE)&\"\"=\"\",\"\",VALUE(VLOOKUP(武器名,VL用!$AM$55:$BM$267,VL用!$DK62,FALSE)))","v":""},null,null,{"$f":"IF(VLOOKUP(防具名,VL用!$BO$55:$CK$168,VL用!$DK62,FALSE)&\"\"=\"\",\"\",VALUE(VLOOKUP(防具名,VL用!$BO$55:$CK$168,VL用!$DK62,FALSE)))","v":""},null,null,{"$f":"IF(VLOOKUP(アクセA,VL用!$CM$55:$DI$278,VL用!$DK62,FALSE)&\"\"=\"\",\"\",VALUE(VLOOKUP(アクセA,VL用!$CM$55:$DI$278,VL用!$DK62,FALSE)))","v":""},null,{"$f":"IF(VLOOKUP(アクセB,VL用!$CM$55:$DI$278,VL用!$DK62,FALSE)&\"\"=\"\",\"\",VALUE(VLOOKUP(アクセB,VL用!$CM$55:$DI$278,VL用!$DK62,FALSE)))","v":""},null,{"$f":"IF(VLOOKUP(アクセC,VL用!$CM$55:$DI$278,VL用!$DK62,FALSE)&\"\"=\"\",\"\",VALUE(VLOOKUP(アクセC,VL用!$CM$55:$DI$278,VL用!$DK62,FALSE)))","v":""},null,null,null,null,null,null,null,null,null,"抵抗",null,null,{"$f":"SUM(F33:AB34)","v":5}]
[null,null,null,null,null,null,null,null,null,null,null,null,null,null,null,null,null,null,null,null,null,null,null,null,null,null,null,null,null,null,null,null,null,null,null,null,null,null,null,null,null,null,1]
[null,null,"敏捷",null,null,{"$f":"IF($S$10=1,VLOOKUP(種族名,VL用!$F$27:$Z$51,VL用!$B37,FALSE),IF($S$10=2,VLOOKUP(種族名,VL用!$AA$27:$AU61,VL用!$B37,FALSE),IF($S$10=3,VLOOKUP(種族名,VL用!$AV$27:$BP$51,VL用!$B37,FALSE),IF($S$10=4,VLOOKUP(種族名,VL用!$BQ$27:$CK$51,VL用!$B37,FALSE),IF($S$10=5,VLOOKUP(種族名,VL用!$CL$27:$DF$51,VL用!$B37,FALSE),IF($S$10=6,VLOOKUP(種族名,VL用!$DG$27:$EA$51,VL用!$B37,FALSE),IF($S$10=7,VLOOKUP(種族名,VL用!$EB$27:$EV$51,VL用!$B37,FALSE),IF($S$10=8,VLOOKUP(種族名,VL用!$EW$27:$FQ$51,VL用!$B37,FALSE),IF($S$10=9,VLOOKUP(種族名,VL用!$FR$27:$GL$51,VL用!$B37,FALSE),IF($S$10=10,VLOOKUP(種族名,VL用!$GM$27:$HG$51,VL用!$B37,FALSE)))))))))))","v":4},null,null,{"$f":"VLOOKUP(クラスA,VL用!$F$54:$P$100,VL用!$B37,FALSE)+VLOOKUP(クラスB,VL用!$F$54:$P$100,VL用!$B37,FALSE)+IF(クラスA=\"WR\",IF(S10<=5,S10,5),0)+IF(クラスB=\"WR\",IF(S10<=5,S10,5),0)-IF(AND(クラスA=\"WR\",クラスB=\"WR\"),IF(S10<=5,S10,5),0)","v":6},null,null,{"$f":"IF(VLOOKUP(武器名,VL用!$AM$55:$BM$267,VL用!$DK64,FALSE)&\"\"=\"\",\"\",VALUE(VLOOKUP(武器名,VL用!$AM$55:$BM$267,VL用!$DK64,FALSE)))","v":1},null,null,{"$f":"IF(VLOOKUP(防具名,VL用!$BO$55:$CK$168,VL用!$DK64,FALSE)&\"\"=\"\",\"\",VALUE(VLOOKUP(防具名,VL用!$BO$55:$CK$168,VL用!$DK64,FALSE)))","v":""},null,null,{"$f":"IF(VLOOKUP(アクセA,VL用!$CM$55:$DI$278,VL用!$DK64,FALSE)&\"\"=\"\",\"\",VALUE(VLOOKUP(アクセA,VL用!$CM$55:$DI$278,VL用!$DK64,FALSE)))","v":""},null,{"$f":"IF(VLOOKUP(アクセB,VL用!$CM$55:$DI$278,VL用!$DK64,FALSE)&\"\"=\"\",\"\",VALUE(VLOOKUP(アクセB,VL用!$CM$55:$DI$278,VL用!$DK64,FALSE)))","v":""},null,{"$f":"IF(VLOOKUP(アクセC,VL用!$CM$55:$DI$278,VL用!$DK64,FALSE)&\"\"=\"\",\"\",VALUE(VLOOKUP(アクセC,VL用!$CM$55:$DI$278,VL用!$DK64,FALSE)))","v":""},null,null,null,null,null,null,null,null,null,"敏捷",null,null,{"$f":"SUM(F35:AB36)","v":11}]
[null,null,null,null,null,null,null,null,null,null,null,null,null,null,null,null,null,null,null,null,null,null,null,null,null,null,null,null,null,null,null,null,null,null,null,null,null,null,null,null,null,null,1]
[null,null,"物攻",null,null,{"$f":"IF($S$10=1,VLOOKUP(種族名,VL用!$F$27:$Z$51,VL用!$B39,FALSE),IF($S$10=2,VLOOKUP(種族名,VL用!$AA$27:$AU63,VL用!$B39,FALSE),IF($S$10=3,VLOOKUP(種族名,VL用!$AV$27:$BP$51,VL用!$B39,FALSE),IF($S$10=4,VLOOKUP(種族名,VL用!$BQ$27:$CK$51,VL用!$B39,FALSE),IF($S$10=5,VLOOKUP(種族名,VL用!$CL$27:$DF$51,VL用!$B39,FALSE),IF($S$10=6,VLOOKUP(種族名,VL用!$DG$27:$EA$51,VL用!$B39,FALSE),IF($S$10=7,VLOOKUP(種族名,VL用!$EB$27:$EV$51,VL用!$B39,FALSE),IF($S$10=8,VLOOKUP(種族名,VL用!$EW$27:$FQ$51,VL用!$B39,FALSE),IF($S$10=9,VLOOKUP(種族名,VL用!$FR$27:$GL$51,VL用!$B39,FALSE),IF($S$10=10,VLOOKUP(種族名,VL用!$GM$27:$HG$51,VL用!$B39,FALSE)))))))))))","v":10},null,null,{"$f":"VLOOKUP(クラスA,VL用!$F$54:$P$100,VL用!$B39,FALSE)+VLOOKUP(クラスB,VL用!$F$54:$P$100,VL用!$B39,FALSE)","v":7},null,null,{"$f":"IF(VLOOKUP(武器名,VL用!$AM$55:$BM$267,VL用!$DK66,FALSE)&\"\"=\"\",\"\",VALUE(VLOOKUP(武器名,VL用!$AM$55:$BM$267,VL用!$DK66,FALSE)))","v":16},null,null,{"$f":"IF(VLOOKUP(防具名,VL用!$BO$55:$CK$168,VL用!$DK66,FALSE)&\"\"=\"\",\"\",VALUE(VLOOKUP(防具名,VL用!$BO$55:$CK$168,VL用!$DK66,FALSE)))","v":""},null,null,{"$f":"IF(VLOOKUP(アクセA,VL用!$CM$55:$DI$278,VL用!$DK66,FALSE)&\"\"=\"\",\"\",VALUE(VLOOKUP(アクセA,VL用!$CM$55:$DI$278,VL用!$DK66,FALSE)))","v":""},null,{"$f":"IF(VLOOKUP(アクセB,VL用!$CM$55:$DI$278,VL用!$DK66,FALSE)&\"\"=\"\",\"\",VALUE(VLOOKUP(アクセB,VL用!$CM$55:$DI$278,VL用!$DK66,FALSE)))","v":""},null,{"$f":"IF(VLOOKUP(アクセC,VL用!$CM$55:$DI$278,VL用!$DK66,FALSE)&\"\"=\"\",\"\",VALUE(VLOOKUP(アクセC,VL用!$CM$55:$DI$278,VL用!$DK66,FALSE)))","v":""},null,null,null,null,null,null,null,null,null,"物攻",null,null,{"$f":"SUM(F37:AB38)","v":33}]
[null,null,null,null,null,null,null,null,null,null,null,null,null,null,null,null,null,null,null,null,null,null,null,null,null,null,null,null,null,null,null,null,null,null,null,null,null,null,null,null,null,null,1]
[null,null,"魔攻",null,null,{"$f":"IF($S$10=1,VLOOKUP(種族名,VL用!$F$27:$Z$51,VL用!$B41,FALSE),IF($S$10=2,VLOOKUP(種族名,VL用!$AA$27:$AU65,VL用!$B41,FALSE),IF($S$10=3,VLOOKUP(種族名,VL用!$AV$27:$BP$51,VL用!$B41,FALSE),IF($S$10=4,VLOOKUP(種族名,VL用!$BQ$27:$CK$51,VL用!$B41,FALSE),IF($S$10=5,VLOOKUP(種族名,VL用!$CL$27:$DF$51,VL用!$B41,FALSE),IF($S$10=6,VLOOKUP(種族名,VL用!$DG$27:$EA$51,VL用!$B41,FALSE),IF($S$10=7,VLOOKUP(種族名,VL用!$EB$27:$EV$51,VL用!$B41,FALSE),IF($S$10=8,VLOOKUP(種族名,VL用!$EW$27:$FQ$51,VL用!$B41,FALSE),IF($S$10=9,VLOOKUP(種族名,VL用!$FR$27:$GL$51,VL用!$B41,FALSE),IF($S$10=10,VLOOKUP(種族名,VL用!$GM$27:$HG$51,VL用!$B41,FALSE)))))))))))","v":10},null,null,{"$f":"VLOOKUP(クラスA,VL用!$F$54:$P$100,VL用!$B41,FALSE)+VLOOKUP(クラスB,VL用!$F$54:$P$100,VL用!$B41,FALSE)","v":7},null,null,{"$f":"IF(VLOOKUP(武器名,VL用!$AM$55:$BM$267,VL用!$DK68,FALSE)&\"\"=\"\",\"\",VALUE(VLOOKUP(武器名,VL用!$AM$55:$BM$267,VL用!$DK68,FALSE)))","v":""},null,null,{"$f":"IF(VLOOKUP(防具名,VL用!$BO$55:$CK$168,VL用!$DK68,FALSE)&\"\"=\"\",\"\",VALUE(VLOOKUP(防具名,VL用!$BO$55:$CK$168,VL用!$DK68,FALSE)))","v":""},null,null,{"$f":"IF(VLOOKUP(アクセA,VL用!$CM$55:$DI$278,VL用!$DK68,FALSE)&\"\"=\"\",\"\",VALUE(VLOOKUP(アクセA,VL用!$CM$55:$DI$278,VL用!$DK68,FALSE)))","v":""},null,{"$f":"IF(VLOOKUP(アクセB,VL用!$CM$55:$DI$278,VL用!$DK68,FALSE)&\"\"=\"\",\"\",VALUE(VLOOKUP(アクセB,VL用!$CM$55:$DI$278,VL用!$DK68,FALSE)))","v":""},null,{"$f":"IF(VLOOKUP(アクセC,VL用!$CM$55:$DI$278,VL用!$DK68,FALSE)&\"\"=\"\",\"\",VALUE(VLOOKUP(アクセC,VL用!$CM$55:$DI$278,VL用!$DK68,FALSE)))","v":""},null,null,null,null,null,null,null,null,null,"魔攻",null,null,{"$f":"SUM(F39:AB40)","v":17}]
[null,null,null,null,null,null,null,null,null,null,null,null,null,null,null,null,null,null,null,null,null,null,null,null,null,null,null,null,null,null,null,null,null,null,null,null,null,null,null,null,null,null,1]
[null,null,"耐久",null,null,{"$f":"IF($S$10=1,VLOOKUP(種族名,VL用!$F$27:$Z$51,VL用!$B43,FALSE),IF($S$10=2,VLOOKUP(種族名,VL用!$AA$27:$AU67,VL用!$B43,FALSE),IF($S$10=3,VLOOKUP(種族名,VL用!$AV$27:$BP$51,VL用!$B43,FALSE),IF($S$10=4,VLOOKUP(種族名,VL用!$BQ$27:$CK$51,VL用!$B43,FALSE),IF($S$10=5,VLOOKUP(種族名,VL用!$CL$27:$DF$51,VL用!$B43,FALSE),IF($S$10=6,VLOOKUP(種族名,VL用!$DG$27:$EA$51,VL用!$B43,FALSE),IF($S$10=7,VLOOKUP(種族名,VL用!$EB$27:$EV$51,VL用!$B43,FALSE),IF($S$10=8,VLOOKUP(種族名,VL用!$EW$27:$FQ$51,VL用!$B43,FALSE),IF($S$10=9,VLOOKUP(種族名,VL用!$FR$27:$GL$51,VL用!$B43,FALSE),IF($S$10=10,VLOOKUP(種族名,VL用!$GM$27:$HG$51,VL用!$B43,FALSE)))))))))))","v":100},null,null,{"$f":"VLOOKUP(クラスA,VL用!$F$54:$P$100,VL用!$B43,FALSE)+VLOOKUP(クラスB,VL用!$F$54:$P$100,VL用!$B43,FALSE)+IF(クラスA=\"BS\",S10*5,0)+IF(クラスA=\"AB\",S10*3,0)+IF(クラスA=\"FM\",(CL+1)*-10)+IF(クラスB=\"BS\",S10*5,0)+IF(クラスB=\"AB\",S10*3,0)+IF(クラスB=\"FM\",(CL+1)*-10)-IF(AND(クラスA=\"BS\",クラスB=\"BS\"),S10*5,0)-IF(AND(クラスA=\"AB\",クラスB=\"AB\"),S10*3,0)-IF(AND(クラスA=\"FM\",クラスB=\"FM\"),(CL+1)*-10)","v":61},null,null,{"$f":"IF(VLOOKUP(武器名,VL用!$AM$55:$BM$267,VL用!$DK70,FALSE)&\"\"=\"\",\"\",VALUE(VLOOKUP(武器名,VL用!$AM$55:$BM$267,VL用!$DK70,FALSE)))","v":""},null,null,{"$f":"IF(VLOOKUP(防具名,VL用!$BO$55:$CK$168,VL用!$DK70,FALSE)&\"\"=\"\",\"\",VALUE(VLOOKUP(防具名,VL用!$BO$55:$CK$168,VL用!$DK70,FALSE)))","v":""},null,null,{"$f":"IF(VLOOKUP(アクセA,VL用!$CM$55:$DI$278,VL用!$DK70,FALSE)&\"\"=\"\",\"\",VALUE(VLOOKUP(アクセA,VL用!$CM$55:$DI$278,VL用!$DK70,FALSE)))","v":""},null,{"$f":"IF(VLOOKUP(アクセB,VL用!$CM$55:$DI$278,VL用!$DK70,FALSE)&\"\"=\"\",\"\",VALUE(VLOOKUP(アクセB,VL用!$CM$55:$DI$278,VL用!$DK70,FALSE)))","v":""},null,{"$f":"IF(VLOOKUP(アクセC,VL用!$CM$55:$DI$278,VL用!$DK70,FALSE)&\"\"=\"\",\"\",VALUE(VLOOKUP(アクセC,VL用!$CM$55:$DI$278,VL用!$DK70,FALSE)))","v":""},null,null,null,null,null,null,null,null,null,"耐久",null,null,{"$f":"SUM(F41:AB42)","v":161}]
[null,null,null,null,null,null,null,null,null,null,null,null,null,null,null,null,null,null,null,null,null,null,null,null,null,null,null,null,null,null,null,null,null,null,null,null,null,null,null,null,null,null,1]
[null,null,"精神",null,null,{"$f":"IF($S$10=1,VLOOKUP(種族名,VL用!$F$27:$Z$51,VL用!$B45,FALSE),IF($S$10=2,VLOOKUP(種族名,VL用!$AA$27:$AU69,VL用!$B45,FALSE),IF($S$10=3,VLOOKUP(種族名,VL用!$AV$27:$BP$51,VL用!$B45,FALSE),IF($S$10=4,VLOOKUP(種族名,VL用!$BQ$27:$CK$51,VL用!$B45,FALSE),IF($S$10=5,VLOOKUP(種族名,VL用!$CL$27:$DF$51,VL用!$B45,FALSE),IF($S$10=6,VLOOKUP(種族名,VL用!$DG$27:$EA$51,VL用!$B45,FALSE),IF($S$10=7,VLOOKUP(種族名,VL用!$EB$27:$EV$51,VL用!$B45,FALSE),IF($S$10=8,VLOOKUP(種族名,VL用!$EW$27:$FQ$51,VL用!$B45,FALSE),IF($S$10=9,VLOOKUP(種族名,VL用!$FR$27:$GL$51,VL用!$B45,FALSE),IF($S$10=10,VLOOKUP(種族名,VL用!$GM$27:$HG$51,VL用!$B45,FALSE)))))))))))","v":30},null,null,{"$f":"VLOOKUP(クラスA,VL用!$F$54:$P$100,VL用!$B45,FALSE)+VLOOKUP(クラスB,VL用!$F$54:$P$100,VL用!$B45,FALSE)+IF(クラスA=\"VC\",S10*2,0)+IF(クラスA=\"AB\",S10)+IF(クラスB=\"VC\",S10*2,0)+IF(クラスB=\"AB\",S10)-IF(AND(クラスA=\"VC\",クラスB=\"VC\"),S10*2,0)-IF(AND(クラスA=\"AB\",クラスB=\"AB\"),S10)","v":15},null,null,{"$f":"IF(VLOOKUP(武器名,VL用!$AM$55:$BM$267,VL用!$DK72,FALSE)&\"\"=\"\",\"\",VALUE(VLOOKUP(武器名,VL用!$AM$55:$BM$267,VL用!$DK72,FALSE)))","v":""},null,null,{"$f":"IF(VLOOKUP(防具名,VL用!$BO$55:$CK$168,VL用!$DK72,FALSE)&\"\"=\"\",\"\",VALUE(VLOOKUP(防具名,VL用!$BO$55:$CK$168,VL用!$DK72,FALSE)))","v":""},null,null,{"$f":"IF(VLOOKUP(アクセA,VL用!$CM$55:$DI$278,VL用!$DK72,FALSE)&\"\"=\"\",\"\",VALUE(VLOOKUP(アクセA,VL用!$CM$55:$DI$278,VL用!$DK72,FALSE)))","v":""},null,{"$f":"IF(VLOOKUP(アクセB,VL用!$CM$55:$DI$278,VL用!$DK72,FALSE)&\"\"=\"\",\"\",VALUE(VLOOKUP(アクセB,VL用!$CM$55:$DI$278,VL用!$DK72,FALSE)))","v":""},null,{"$f":"IF(VLOOKUP(アクセC,VL用!$CM$55:$DI$278,VL用!$DK72,FALSE)&\"\"=\"\",\"\",VALUE(VLOOKUP(アクセC,VL用!$CM$55:$DI$278,VL用!$DK72,FALSE)))","v":""},null,null,null,null,null,null,null,null,null,"精神",null,null,{"$f":"SUM(F43:AB44)","v":45}]
[null,null,null,null,null,null,null,null,null,null,null,null,null,null,null,null,null,null,null,null,null,null,null,null,null,null,null,null,null,null,null,null,null,null,null,null,null,null,null,null,null,null,2]
[null,null,"耐性","近",null,{"$f":"IF($S$10=1,VLOOKUP(種族名,VL用!$F$27:$Z$51,VL用!$B46,FALSE),IF($S$10=2,VLOOKUP(種族名,VL用!$AA$27:$AU69,VL用!$B46,FALSE),IF($S$10=3,VLOOKUP(種族名,VL用!$AV$27:$BP$51,VL用!$B46,FALSE),IF($S$10=4,VLOOKUP(種族名,VL用!$BQ$27:$CK$51,VL用!$B46,FALSE),IF($S$10=5,VLOOKUP(種族名,VL用!$CL$27:$DF$51,VL用!$B46,FALSE),IF($S$10=6,VLOOKUP(種族名,VL用!$DG$27:$EA$51,VL用!$B46,FALSE),IF($S$10=7,VLOOKUP(種族名,VL用!$EB$27:$EV$51,VL用!$B46,FALSE),IF($S$10=8,VLOOKUP(種族名,VL用!$EW$27:$FQ$51,VL用!$B46,FALSE),IF($S$10=9,VLOOKUP(種族名,VL用!$FR$27:$GL$51,VL用!$B46,FALSE),IF($S$10=10,VLOOKUP(種族名,VL用!$GM$27:$HG$51,VL用!$B46,FALSE)))))))))))","v":10},null,null,{"$f":"IF(VL用!AS2=0,\"\",VL用!AS2)","v":""},null,null,{"$f":"IF(VLOOKUP(武器名,VL用!$AM$55:$BM$267,VL用!$DK73,FALSE)&\"\"=\"\",\"\",VALUE(VLOOKUP(武器名,VL用!$AM$55:$BM$267,VL用!$DK73,FALSE)))","v":-7},null,null,{"$f":"IF(VLOOKUP(防具名,VL用!$BO$55:$CK$168,VL用!$DK73,FALSE)&\"\"=\"\",\"\",VALUE(VLOOKUP(防具名,VL用!$BO$55:$CK$168,VL用!$DK73,FALSE)))","v":-10},null,null,{"$f":"IF(VLOOKUP(アクセA,VL用!$CM$55:$DI$278,VL用!$DK73,FALSE)&\"\"=\"\",\"\",VALUE(VLOOKUP(アクセA,VL用!$CM$55:$DI$278,VL用!$DK73,FALSE)))","v":""},null,{"$f":"IF(VLOOKUP(アクセB,VL用!$CM$55:$DI$278,VL用!$DK73,FALSE)&\"\"=\"\",\"\",VALUE(VLOOKUP(アクセB,VL用!$CM$55:$DI$278,VL用!$DK73,FALSE)))","v":""},null,{"$f":"IF(VLOOKUP(アクセC,VL用!$CM$55:$DI$278,VL用!$DK73,FALSE)&\"\"=\"\",\"\",VALUE(VLOOKUP(アクセC,VL用!$CM$55:$DI$278,VL用!$DK73,FALSE)))","v":""},null,null,null,null,null,null,2,null,"耐性","近",null,null,{"$f":"SUM(F45:AB45)","v":-7}]
[null,null,null,"遠",null,{"$f":"IF($S$10=1,VLOOKUP(種族名,VL用!$F$27:$Z$51,VL用!$B47,FALSE),IF($S$10=2,VLOOKUP(種族名,VL用!$AA$27:$AU70,VL用!$B47,FALSE),IF($S$10=3,VLOOKUP(種族名,VL用!$AV$27:$BP$51,VL用!$B47,FALSE),IF($S$10=4,VLOOKUP(種族名,VL用!$BQ$27:$CK$51,VL用!$B47,FALSE),IF($S$10=5,VLOOKUP(種族名,VL用!$CL$27:$DF$51,VL用!$B47,FALSE),IF($S$10=6,VLOOKUP(種族名,VL用!$DG$27:$EA$51,VL用!$B47,FALSE),IF($S$10=7,VLOOKUP(種族名,VL用!$EB$27:$EV$51,VL用!$B47,FALSE),IF($S$10=8,VLOOKUP(種族名,VL用!$EW$27:$FQ$51,VL用!$B47,FALSE),IF($S$10=9,VLOOKUP(種族名,VL用!$FR$27:$GL$51,VL用!$B47,FALSE),IF($S$10=10,VLOOKUP(種族名,VL用!$GM$27:$HG$51,VL用!$B47,FALSE)))))))))))","v":10},null,null,{"$f":"IF(VL用!AS3=0,\"\",VL用!AS3)","v":""},null,null,{"$f":"IF(VLOOKUP(武器名,VL用!$AM$55:$BM$267,VL用!$DK74,FALSE)&\"\"=\"\",\"\",VALUE(VLOOKUP(武器名,VL用!$AM$55:$BM$267,VL用!$DK74,FALSE)))","v":-7},null,null,{"$f":"IF(VLOOKUP(防具名,VL用!$BO$55:$CK$168,VL用!$DK74,FALSE)&\"\"=\"\",\"\",VALUE(VLOOKUP(防具名,VL用!$BO$55:$CK$168,VL用!$DK74,FALSE)))","v":-10},null,null,{"$f":"IF(VLOOKUP(アクセA,VL用!$CM$55:$DI$278,VL用!$DK74,FALSE)&\"\"=\"\",\"\",VALUE(VLOOKUP(アクセA,VL用!$CM$55:$DI$278,VL用!$DK74,FALSE)))","v":""},null,{"$f":"IF(VLOOKUP(アクセB,VL用!$CM$55:$DI$278,VL用!$DK74,FALSE)&\"\"=\"\",\"\",VALUE(VLOOKUP(アクセB,VL用!$CM$55:$DI$278,VL用!$DK74,FALSE)))","v":""},null,{"$f":"IF(VLOOKUP(アクセC,VL用!$CM$55:$DI$278,VL用!$DK74,FALSE)&\"\"=\"\",\"\",VALUE(VLOOKUP(アクセC,VL用!$CM$55:$DI$278,VL用!$DK74,FALSE)))","v":""},null,null,null,null,null,null,null,null,null,"遠",null,null,{"$f":"SUM(F46:AB46)","v":-7},null,null,null,null,null,null,null,3]
[null,null,null,"炎",null,{"$f":"IF($S$10=1,VLOOKUP(種族名,VL用!$F$27:$Z$51,VL用!$B48,FALSE),IF($S$10=2,VLOOKUP(種族名,VL用!$AA$27:$AU71,VL用!$B48,FALSE),IF($S$10=3,VLOOKUP(種族名,VL用!$AV$27:$BP$51,VL用!$B48,FALSE),IF($S$10=4,VLOOKUP(種族名,VL用!$BQ$27:$CK$51,VL用!$B48,FALSE),IF($S$10=5,VLOOKUP(種族名,VL用!$CL$27:$DF$51,VL用!$B48,FALSE),IF($S$10=6,VLOOKUP(種族名,VL用!$DG$27:$EA$51,VL用!$B48,FALSE),IF($S$10=7,VLOOKUP(種族名,VL用!$EB$27:$EV$51,VL用!$B48,FALSE),IF($S$10=8,VLOOKUP(種族名,VL用!$EW$27:$FQ$51,VL用!$B48,FALSE),IF($S$10=9,VLOOKUP(種族名,VL用!$FR$27:$GL$51,VL用!$B48,FALSE),IF($S$10=10,VLOOKUP(種族名,VL用!$GM$27:$HG$51,VL用!$B48,FALSE)))))))))))+IF(種族名=\"キメラ忌\",CL*2+5,0)","v":0},null,null,{"$f":"IF(VL用!AS4=0,\"\",VL用!AS4)","v":3},null,null,{"$f":"IF(VLOOKUP(武器名,VL用!$AM$55:$BM$267,VL用!$DK75,FALSE)&\"\"=\"\",\"\",VALUE(VLOOKUP(武器名,VL用!$AM$55:$BM$267,VL用!$DK75,FALSE)))","v":""},null,null,{"$f":"IF(VLOOKUP(防具名,VL用!$BO$55:$CK$168,VL用!$DK75,FALSE)&\"\"=\"\",\"\",VALUE(VLOOKUP(防具名,VL用!$BO$55:$CK$168,VL用!$DK75,FALSE)))","v":-10},null,null,{"$f":"IF(VLOOKUP(アクセA,VL用!$CM$55:$DI$278,VL用!$DK75,FALSE)&\"\"=\"\",\"\",VALUE(VLOOKUP(アクセA,VL用!$CM$55:$DI$278,VL用!$DK75,FALSE)))","v":""},null,{"$f":"IF(VLOOKUP(アクセB,VL用!$CM$55:$DI$278,VL用!$DK75,FALSE)&\"\"=\"\",\"\",VALUE(VLOOKUP(アクセB,VL用!$CM$55:$DI$278,VL用!$DK75,FALSE)))","v":""},null,{"$f":"IF(VLOOKUP(アクセC,VL用!$CM$55:$DI$278,VL用!$DK75,FALSE)&\"\"=\"\",\"\",VALUE(VLOOKUP(アクセC,VL用!$CM$55:$DI$278,VL用!$DK75,FALSE)))","v":""},null,null,null,null,null,null,null,null,null,"炎",null,null,-7]
[null,null,null,"氷",null,{"$f":"IF($S$10=1,VLOOKUP(種族名,VL用!$F$27:$Z$51,VL用!$B49,FALSE),IF($S$10=2,VLOOKUP(種族名,VL用!$AA$27:$AU72,VL用!$B49,FALSE),IF($S$10=3,VLOOKUP(種族名,VL用!$AV$27:$BP$51,VL用!$B49,FALSE),IF($S$10=4,VLOOKUP(種族名,VL用!$BQ$27:$CK$51,VL用!$B49,FALSE),IF($S$10=5,VLOOKUP(種族名,VL用!$CL$27:$DF$51,VL用!$B49,FALSE),IF($S$10=6,VLOOKUP(種族名,VL用!$DG$27:$EA$51,VL用!$B49,FALSE),IF($S$10=7,VLOOKUP(種族名,VL用!$EB$27:$EV$51,VL用!$B49,FALSE),IF($S$10=8,VLOOKUP(種族名,VL用!$EW$27:$FQ$51,VL用!$B49,FALSE),IF($S$10=9,VLOOKUP(種族名,VL用!$FR$27:$GL$51,VL用!$B49,FALSE),IF($S$10=10,VLOOKUP(種族名,VL用!$GM$27:$HG$51,VL用!$B49,FALSE)))))))))))+IF(種族名=\"キメラ忌\",CL*2+5,0)","v":0},null,null,{"$f":"IF(VL用!AS5=0,\"\",VL用!AS5)","v":5},null,null,{"$f":"IF(VLOOKUP(武器名,VL用!$AM$55:$BM$267,VL用!$DK76,FALSE)&\"\"=\"\",\"\",VALUE(VLOOKUP(武器名,VL用!$AM$55:$BM$267,VL用!$DK76,FALSE)))","v":""},null,null,{"$f":"IF(VLOOKUP(防具名,VL用!$BO$55:$CK$168,VL用!$DK76,FALSE)&\"\"=\"\",\"\",VALUE(VLOOKUP(防具名,VL用!$BO$55:$CK$168,VL用!$DK76,FALSE)))","v":-10},null,null,{"$f":"IF(VLOOKUP(アクセA,VL用!$CM$55:$DI$278,VL用!$DK76,FALSE)&\"\"=\"\",\"\",VALUE(VLOOKUP(アクセA,VL用!$CM$55:$DI$278,VL用!$DK76,FALSE)))","v":""},null,{"$f":"IF(VLOOKUP(アクセB,VL用!$CM$55:$DI$278,VL用!$DK76,FALSE)&\"\"=\"\",\"\",VALUE(VLOOKUP(アクセB,VL用!$CM$55:$DI$278,VL用!$DK76,FALSE)))","v":""},null,{"$f":"IF(VLOOKUP(アクセC,VL用!$CM$55:$DI$278,VL用!$DK76,FALSE)&\"\"=\"\",\"\",VALUE(VLOOKUP(アクセC,VL用!$CM$55:$DI$278,VL用!$DK76,FALSE)))","v":""},null,null,null,null,null,null,null,null,null,"氷",null,null,-5,null,null,null,null,null,null,null,4]
[null,null,null,"水",null,{"$f":"IF($S$10=1,VLOOKUP(種族名,VL用!$F$27:$Z$51,VL用!$B50,FALSE),IF($S$10=2,VLOOKUP(種族名,VL用!$AA$27:$AU73,VL用!$B50,FALSE),IF($S$10=3,VLOOKUP(種族名,VL用!$AV$27:$BP$51,VL用!$B50,FALSE),IF($S$10=4,VLOOKUP(種族名,VL用!$BQ$27:$CK$51,VL用!$B50,FALSE),IF($S$10=5,VLOOKUP(種族名,VL用!$CL$27:$DF$51,VL用!$B50,FALSE),IF($S$10=6,VLOOKUP(種族名,VL用!$DG$27:$EA$51,VL用!$B50,FALSE),IF($S$10=7,VLOOKUP(種族名,VL用!$EB$27:$EV$51,VL用!$B50,FALSE),IF($S$10=8,VLOOKUP(種族名,VL用!$EW$27:$FQ$51,VL用!$B50,FALSE),IF($S$10=9,VLOOKUP(種族名,VL用!$FR$27:$GL$51,VL用!$B50,FALSE),IF($S$10=10,VLOOKUP(種族名,VL用!$GM$27:$HG$51,VL用!$B50,FALSE)))))))))))+IF(種族名=\"キメラ忌\",CL*2+5,0)","v":-5},null,null,{"$f":"IF(VL用!AS6=0,\"\",VL用!AS6)","v":2},null,null,{"$f":"IF(VLOOKUP(武器名,VL用!$AM$55:$BM$267,VL用!$DK77,FALSE)&\"\"=\"\",\"\",VALUE(VLOOKUP(武器名,VL用!$AM$55:$BM$267,VL用!$DK77,FALSE)))","v":""},null,null,{"$f":"IF(VLOOKUP(防具名,VL用!$BO$55:$CK$168,VL用!$DK77,FALSE)&\"\"=\"\",\"\",VALUE(VLOOKUP(防具名,VL用!$BO$55:$CK$168,VL用!$DK77,FALSE)))","v":-10},null,null,{"$f":"IF(VLOOKUP(アクセA,VL用!$CM$55:$DI$278,VL用!$DK77,FALSE)&\"\"=\"\",\"\",VALUE(VLOOKUP(アクセA,VL用!$CM$55:$DI$278,VL用!$DK77,FALSE)))","v":""},null,{"$f":"IF(VLOOKUP(アクセB,VL用!$CM$55:$DI$278,VL用!$DK77,FALSE)&\"\"=\"\",\"\",VALUE(VLOOKUP(アクセB,VL用!$CM$55:$DI$278,VL用!$DK77,FALSE)))","v":""},null,{"$f":"IF(VLOOKUP(アクセC,VL用!$CM$55:$DI$278,VL用!$DK77,FALSE)&\"\"=\"\",\"\",VALUE(VLOOKUP(アクセC,VL用!$CM$55:$DI$278,VL用!$DK77,FALSE)))","v":""},null,null,null,null,null,null,null,null,null,"水",null,null,-13]
[null,null,null,"雷",null,{"$f":"IF($S$10=1,VLOOKUP(種族名,VL用!$F$27:$Z$51,VL用!$B51,FALSE),IF($S$10=2,VLOOKUP(種族名,VL用!$AA$27:$AU74,VL用!$B51,FALSE),IF($S$10=3,VLOOKUP(種族名,VL用!$AV$27:$BP$51,VL用!$B51,FALSE),IF($S$10=4,VLOOKUP(種族名,VL用!$BQ$27:$CK$51,VL用!$B51,FALSE),IF($S$10=5,VLOOKUP(種族名,VL用!$CL$27:$DF$51,VL用!$B51,FALSE),IF($S$10=6,VLOOKUP(種族名,VL用!$DG$27:$EA$51,VL用!$B51,FALSE),IF($S$10=7,VLOOKUP(種族名,VL用!$EB$27:$EV$51,VL用!$B51,FALSE),IF($S$10=8,VLOOKUP(種族名,VL用!$EW$27:$FQ$51,VL用!$B51,FALSE),IF($S$10=9,VLOOKUP(種族名,VL用!$FR$27:$GL$51,VL用!$B51,FALSE),IF($S$10=10,VLOOKUP(種族名,VL用!$GM$27:$HG$51,VL用!$B51,FALSE)))))))))))+IF(種族名=\"キメラ忌\",CL*2+5,0)","v":0},null,null,{"$f":"IF(VL用!AS7=0,\"\",VL用!AS7)","v":2},null,null,{"$f":"IF(VLOOKUP(武器名,VL用!$AM$55:$BM$267,VL用!$DK78,FALSE)&\"\"=\"\",\"\",VALUE(VLOOKUP(武器名,VL用!$AM$55:$BM$267,VL用!$DK78,FALSE)))","v":""},null,null,{"$f":"IF(VLOOKUP(防具名,VL用!$BO$55:$CK$168,VL用!$DK78,FALSE)&\"\"=\"\",\"\",VALUE(VLOOKUP(防具名,VL用!$BO$55:$CK$168,VL用!$DK78,FALSE)))","v":-10},null,null,{"$f":"IF(VLOOKUP(アクセA,VL用!$CM$55:$DI$278,VL用!$DK78,FALSE)&\"\"=\"\",\"\",VALUE(VLOOKUP(アクセA,VL用!$CM$55:$DI$278,VL用!$DK78,FALSE)))","v":""},null,{"$f":"IF(VLOOKUP(アクセB,VL用!$CM$55:$DI$278,VL用!$DK78,FALSE)&\"\"=\"\",\"\",VALUE(VLOOKUP(アクセB,VL用!$CM$55:$DI$278,VL用!$DK78,FALSE)))","v":""},null,{"$f":"IF(VLOOKUP(アクセC,VL用!$CM$55:$DI$278,VL用!$DK78,FALSE)&\"\"=\"\",\"\",VALUE(VLOOKUP(アクセC,VL用!$CM$55:$DI$278,VL用!$DK78,FALSE)))","v":""},null,null,null,null,null,null,1,null,null,"雷",null,null,{"$f":"SUM(F50:AB50)","v":-8},null,null,null,null,null,null,null,5]
[null,null,null,"風",null,{"$f":"IF($S$10=1,VLOOKUP(種族名,VL用!$F$27:$Z$51,VL用!$B52,FALSE),IF($S$10=2,VLOOKUP(種族名,VL用!$AA$27:$AU75,VL用!$B52,FALSE),IF($S$10=3,VLOOKUP(種族名,VL用!$AV$27:$BP$51,VL用!$B52,FALSE),IF($S$10=4,VLOOKUP(種族名,VL用!$BQ$27:$CK$51,VL用!$B52,FALSE),IF($S$10=5,VLOOKUP(種族名,VL用!$CL$27:$DF$51,VL用!$B52,FALSE),IF($S$10=6,VLOOKUP(種族名,VL用!$DG$27:$EA$51,VL用!$B52,FALSE),IF($S$10=7,VLOOKUP(種族名,VL用!$EB$27:$EV$51,VL用!$B52,FALSE),IF($S$10=8,VLOOKUP(種族名,VL用!$EW$27:$FQ$51,VL用!$B52,FALSE),IF($S$10=9,VLOOKUP(種族名,VL用!$FR$27:$GL$51,VL用!$B52,FALSE),IF($S$10=10,VLOOKUP(種族名,VL用!$GM$27:$HG$51,VL用!$B52,FALSE)))))))))))+IF(種族名=\"キメラ忌\",CL*2+5,0)","v":5},null,null,{"$f":"IF(VL用!AS8=0,\"\",VL用!AS8)","v":2},null,null,{"$f":"IF(VLOOKUP(武器名,VL用!$AM$55:$BM$267,VL用!$DK79,FALSE)&\"\"=\"\",\"\",VALUE(VLOOKUP(武器名,VL用!$AM$55:$BM$267,VL用!$DK79,FALSE)))","v":""},null,null,{"$f":"IF(VLOOKUP(防具名,VL用!$BO$55:$CK$168,VL用!$DK79,FALSE)&\"\"=\"\",\"\",VALUE(VLOOKUP(防具名,VL用!$BO$55:$CK$168,VL用!$DK79,FALSE)))","v":-10},null,null,{"$f":"IF(VLOOKUP(アクセA,VL用!$CM$55:$DI$278,VL用!$DK79,FALSE)&\"\"=\"\",\"\",VALUE(VLOOKUP(アクセA,VL用!$CM$55:$DI$278,VL用!$DK79,FALSE)))","v":""},null,{"$f":"IF(VLOOKUP(アクセB,VL用!$CM$55:$DI$278,VL用!$DK79,FALSE)&\"\"=\"\",\"\",VALUE(VLOOKUP(アクセB,VL用!$CM$55:$DI$278,VL用!$DK79,FALSE)))","v":""},null,{"$f":"IF(VLOOKUP(アクセC,VL用!$CM$55:$DI$278,VL用!$DK79,FALSE)&\"\"=\"\",\"\",VALUE(VLOOKUP(アクセC,VL用!$CM$55:$DI$278,VL用!$DK79,FALSE)))","v":""},null,null,null,null,null,null,null,null,null,"風",null,null,-3]
[null,null,null,"土",null,{"$f":"IF($S$10=1,VLOOKUP(種族名,VL用!$F$27:$Z$51,VL用!$B53,FALSE),IF($S$10=2,VLOOKUP(種族名,VL用!$AA$27:$AU76,VL用!$B53,FALSE),IF($S$10=3,VLOOKUP(種族名,VL用!$AV$27:$BP$51,VL用!$B53,FALSE),IF($S$10=4,VLOOKUP(種族名,VL用!$BQ$27:$CK$51,VL用!$B53,FALSE),IF($S$10=5,VLOOKUP(種族名,VL用!$CL$27:$DF$51,VL用!$B53,FALSE),IF($S$10=6,VLOOKUP(種族名,VL用!$DG$27:$EA$51,VL用!$B53,FALSE),IF($S$10=7,VLOOKUP(種族名,VL用!$EB$27:$EV$51,VL用!$B53,FALSE),IF($S$10=8,VLOOKUP(種族名,VL用!$EW$27:$FQ$51,VL用!$B53,FALSE),IF($S$10=9,VLOOKUP(種族名,VL用!$FR$27:$GL$51,VL用!$B53,FALSE),IF($S$10=10,VLOOKUP(種族名,VL用!$GM$27:$HG$51,VL用!$B53,FALSE)))))))))))+IF(種族名=\"キメラ忌\",CL*2+5,0)","v":2},null,null,{"$f":"IF(VL用!AS9=0,\"\",VL用!AS9)","v":2},null,null,{"$f":"IF(VLOOKUP(武器名,VL用!$AM$55:$BM$267,VL用!$DK80,FALSE)&\"\"=\"\",\"\",VALUE(VLOOKUP(武器名,VL用!$AM$55:$BM$267,VL用!$DK80,FALSE)))","v":""},null,null,{"$f":"IF(VLOOKUP(防具名,VL用!$BO$55:$CK$168,VL用!$DK80,FALSE)&\"\"=\"\",\"\",VALUE(VLOOKUP(防具名,VL用!$BO$55:$CK$168,VL用!$DK80,FALSE)))","v":-10},null,null,{"$f":"IF(VLOOKUP(アクセA,VL用!$CM$55:$DI$278,VL用!$DK80,FALSE)&\"\"=\"\",\"\",VALUE(VLOOKUP(アクセA,VL用!$CM$55:$DI$278,VL用!$DK80,FALSE)))","v":""},null,{"$f":"IF(VLOOKUP(アクセB,VL用!$CM$55:$DI$278,VL用!$DK80,FALSE)&\"\"=\"\",\"\",VALUE(VLOOKUP(アクセB,VL用!$CM$55:$DI$278,VL用!$DK80,FALSE)))","v":""},null,{"$f":"IF(VLOOKUP(アクセC,VL用!$CM$55:$DI$278,VL用!$DK80,FALSE)&\"\"=\"\",\"\",VALUE(VLOOKUP(アクセC,VL用!$CM$55:$DI$278,VL用!$DK80,FALSE)))","v":""},null,null,null,null,null,null,null,null,null,"土",null,null,-6,null,null,null,null,null,null,null,7]
[null,null,null,"光",null,{"$f":"IF($S$10=1,VLOOKUP(種族名,VL用!$F$27:$Z$51,VL用!$B54,FALSE),IF($S$10=2,VLOOKUP(種族名,VL用!$AA$27:$AU77,VL用!$B54,FALSE),IF($S$10=3,VLOOKUP(種族名,VL用!$AV$27:$BP$51,VL用!$B54,FALSE),IF($S$10=4,VLOOKUP(種族名,VL用!$BQ$27:$CK$51,VL用!$B54,FALSE),IF($S$10=5,VLOOKUP(種族名,VL用!$CL$27:$DF$51,VL用!$B54,FALSE),IF($S$10=6,VLOOKUP(種族名,VL用!$DG$27:$EA$51,VL用!$B54,FALSE),IF($S$10=7,VLOOKUP(種族名,VL用!$EB$27:$EV$51,VL用!$B54,FALSE),IF($S$10=8,VLOOKUP(種族名,VL用!$EW$27:$FQ$51,VL用!$B54,FALSE),IF($S$10=9,VLOOKUP(種族名,VL用!$FR$27:$GL$51,VL用!$B54,FALSE),IF($S$10=10,VLOOKUP(種族名,VL用!$GM$27:$HG$51,VL用!$B54,FALSE)))))))))))+IF(種族名=\"キメラ忌\",CL*2+5,0)","v":4},null,null,{"$f":"IF(VL用!AS10=0,\"\",VL用!AS10)","v":""},null,null,{"$f":"IF(VLOOKUP(武器名,VL用!$AM$55:$BM$267,VL用!$DK81,FALSE)&\"\"=\"\",\"\",VALUE(VLOOKUP(武器名,VL用!$AM$55:$BM$267,VL用!$DK81,FALSE)))","v":""},null,null,{"$f":"IF(VLOOKUP(防具名,VL用!$BO$55:$CK$168,VL用!$DK81,FALSE)&\"\"=\"\",\"\",VALUE(VLOOKUP(防具名,VL用!$BO$55:$CK$168,VL用!$DK81,FALSE)))","v":-10},null,null,{"$f":"IF(VLOOKUP(アクセA,VL用!$CM$55:$DI$278,VL用!$DK81,FALSE)&\"\"=\"\",\"\",VALUE(VLOOKUP(アクセA,VL用!$CM$55:$DI$278,VL用!$DK81,FALSE)))","v":""},null,{"$f":"IF(VLOOKUP(アクセB,VL用!$CM$55:$DI$278,VL用!$DK81,FALSE)&\"\"=\"\",\"\",VALUE(VLOOKUP(アクセB,VL用!$CM$55:$DI$278,VL用!$DK81,FALSE)))","v":""},null,{"$f":"IF(VLOOKUP(アクセC,VL用!$CM$55:$DI$278,VL用!$DK81,FALSE)&\"\"=\"\",\"\",VALUE(VLOOKUP(アクセC,VL用!$CM$55:$DI$278,VL用!$DK81,FALSE)))","v":""},null,null,null,null,null,null,null,null,null,"光",null,null,-6]
[null,null,null,"闇",null,{"$f":"IF($S$10=1,VLOOKUP(種族名,VL用!$F$27:$Z$51,VL用!$B55,FALSE),IF($S$10=2,VLOOKUP(種族名,VL用!$AA$27:$AU78,VL用!$B55,FALSE),IF($S$10=3,VLOOKUP(種族名,VL用!$AV$27:$BP$51,VL用!$B55,FALSE),IF($S$10=4,VLOOKUP(種族名,VL用!$BQ$27:$CK$51,VL用!$B55,FALSE),IF($S$10=5,VLOOKUP(種族名,VL用!$CL$27:$DF$51,VL用!$B55,FALSE),IF($S$10=6,VLOOKUP(種族名,VL用!$DG$27:$EA$51,VL用!$B55,FALSE),IF($S$10=7,VLOOKUP(種族名,VL用!$EB$27:$EV$51,VL用!$B55,FALSE),IF($S$10=8,VLOOKUP(種族名,VL用!$EW$27:$FQ$51,VL用!$B55,FALSE),IF($S$10=9,VLOOKUP(種族名,VL用!$FR$27:$GL$51,VL用!$B55,FALSE),IF($S$10=10,VLOOKUP(種族名,VL用!$GM$27:$HG$51,VL用!$B55,FALSE)))))))))))+IF(種族名=\"キメラ忌\",CL*2+5,0)","v":3},null,null,{"$f":"IF(VL用!AS11=0,\"\",VL用!AS11)","v":""},null,null,{"$f":"IF(VLOOKUP(武器名,VL用!$AM$55:$BM$267,VL用!$DK82,FALSE)&\"\"=\"\",\"\",VALUE(VLOOKUP(武器名,VL用!$AM$55:$BM$267,VL用!$DK82,FALSE)))","v":""},null,null,{"$f":"IF(VLOOKUP(防具名,VL用!$BO$55:$CK$168,VL用!$DK82,FALSE)&\"\"=\"\",\"\",VALUE(VLOOKUP(防具名,VL用!$BO$55:$CK$168,VL用!$DK82,FALSE)))","v":-10},null,null,{"$f":"IF(VLOOKUP(アクセA,VL用!$CM$55:$DI$278,VL用!$DK82,FALSE)&\"\"=\"\",\"\",VALUE(VLOOKUP(アクセA,VL用!$CM$55:$DI$278,VL用!$DK82,FALSE)))","v":""},null,{"$f":"IF(VLOOKUP(アクセB,VL用!$CM$55:$DI$278,VL用!$DK82,FALSE)&\"\"=\"\",\"\",VALUE(VLOOKUP(アクセB,VL用!$CM$55:$DI$278,VL用!$DK82,FALSE)))","v":""},null,{"$f":"IF(VLOOKUP(アクセC,VL用!$CM$55:$DI$278,VL用!$DK82,FALSE)&\"\"=\"\",\"\",VALUE(VLOOKUP(アクセC,VL用!$CM$55:$DI$278,VL用!$DK82,FALSE)))","v":""},null,null,null,null,null,null,null,null,null,"闇",null,null,-7,null,null,null,null,null,null,null,9]

{"sheet":"コピペ用","index":1,"n_rows":52,"n_cols":139,"rows_kept":52,"cut":false,"hidden":false,"merged":[[45,135,46,137],[45,138,46,148],[45,101,46,111],[45,112,46,118],[45,119,46,120],[45,121,46,122],[45,123,46,125],[45,126,46,127],[45,128,46,129],[45,130,46,132],[45,133,46,134],[45,75,46,81],[45,82,46,83],[45,84,46,85],[45,86,46,88],[45,89,46,90],[45,91,46,92],[45,93,46,95],[45,96,46,97],[45,98,46,100],[41,135,42,137],[41,138,42,148],[43,75,44,81],[43,82,44,83],[43,84,44,85],[43,86,44,88],[43,89,44,90],[43,91,44,92],[43,93,44,95],[43,96,44,97],[43,98,44,100],[43,101,44,111],[43,112,44,118],[43,119,44,120],[43,121,44,122],[43,123,44,125],[43,126,44,127],[43,128,44,129],[43,130,44,132],[43,133,44,134],[43,135,44,137],[43,138,44,148],[41,101,42,111],[41,112,42,118],[41,119,42,120],[41,121,42,122],[41,123,42,125],[41,126,42,127],[41,128,42,129],[41,130,42,132],[41,133,42,134],[41,75,42,81],[41,82,42,83],[41,84,42,85],[41,86,42,88],[41,89,42,90],[41,91,42,92],[41,93,42,95],[41,96,42,97],[41,98,42,100],[37,135,38,137],[37,138,38,148],[39,75,40,81],[39,82,40,83],[39,84,40,85],[39,86,40,88],[39,89,40,90],[39,91,40,92],[39,93,40,95],[39,96,40,97],[39,98,40,100],[39,101,40,111],[39,112,40,118],[39,119,40,120],[39,121,40,122],[39,123,40,125],[39,126,40,127],[39,128,40,129],[39,130,40,132],[39,133,40,134],[39,135,40,137],[39,138,40,148],[37,101,38,111],[37,112,38,118],[37,119,38,120],[37,121,38,122],[37,123,38,125],[37,126,38,127],[37,128,38,129],[37,130,38,132],[37,133,38,134],[37,75,38,81],[37,82,38,83],[37,84,38,85],[37,86,38,88],[37,89,38,90],[37,91,38,92],[37,93,38,95],[37,96,38,97],[37,98,38,100],[33,135,34,137],[33,138,34,148],[35,75,36,81],[35,82,36,83],[35,84,36,85],[35,86,36,88],[35,89,36,90],[35,91,36,92],[35,93,36,95],[35,96,36,97],[35,98,36,100],[35,101,36,111],[35,112,36,118],[35,119,36,120],[35,121,36,122],[35,123,36,125],[35,126,36,127],[35,128,36,129],[35,130,36,132],[35,133,36,134],[35,135,36,137],[35,138,36,148],[33,101,34,111],[33,112,34,118],[33,119,34,120],[33,121,34,122],[33,123,34,125],[33,126,34,127],[33,128,34,129],[33,130,34,132],[33,133,34,134],[33,75,34,81],[33,82,34,83],[33,84,34,85],[33,86,34,88],[33,89,34,90],[33,91,34,92],[33,93,34,95],[33,96,34,97],[33,98,34,100],[29,135,30,137],[29,138,30,148],[31,75,32,81],[31,82,32,83],[31,84,32,85],[31,86,32,88],[31,89,32,90],[31,91,32,92],[31,93,32,95],[31,96,32,97],[31,98,32,100],[31,101,32,111],[31,112,32,118],[31,119,32,120],[31,121,32,122],[31,123,32,125],[31,126,32,127],[31,128,32,129],[31,130,32,132],[31,133,32,134],[31,135,32,137],[31,138,32,148],[29,101,30,111],[29,112,30,118],[29,119,30,120],[29,121,30,122],[29,123,30,125],[29,126,30,127],[29,128,30,129],[29,130,30,132],[29,133,30,134],[29,75,30,81],[29,82,30,83],[29,84,30,85],[29,86,30,88],[29,89,30,90],[29,91,30,92],[29,93,30,95],[29,96,30,97],[29,98,30,100],[25,135,26,137],[25,138,26,148],[27,75,28,81],[27,82,28,83],[27,84,28,85],[27,86,28,88],[27,89,28,90],[27,91,28,92],[27,93,28,95],[27,96,28,97],[27,98,28,100],[27,101,28,111],[27,112,28,118],[27,119,28,120],[27,121,28,122],[27,123,28,125],[27,126,28,127],[27,128,28,129],[27,130,28,132],[27,133,28,134],[27,135,28,137],[27,138,28,148],[25,101,26,111],[25,112,26,118],[25,119,26,120],[25,121,26,122],[25,123,26,125],[25,126,26,127],[25,128,26,129],[25,130,26,132],[25,133,26,134],[25,75,26,81],[25,82,26,83],[25,84,26,85],[25,86,26,88],[25,89,26,90],[25,91,26,92],[25,93,26,95],[25,96,26,97],[25,98,26,100],[21,135,22,137],[21,138,22,148],[23,75,24,81],[23,82,24,83],[23,84,24,85],[23,86,24,88],[23,89,24,90],[23,91,24,92],[23,93,24,95],[23,96,24,97],[23,98,24,100],[23,101,24,111],[23,112,24,118],[23,119,24,120],[23,121,24,122],[23,123,24,125],[23,126,24,127],[23,128,24,129],[23,130,24,132],[23,133,24,134],[23,135,24,137],[23,138,24,148],[21,101,22,111],[21,112,22,118],[21,119,22,120],[21,121,22,122],[21,123,22,125],[21,126,22,127],[21,128,22,129],[21,130,22,132],[21,133,22,134],[21,75,22,81],[21,82,22,83],[21,84,22,85],[21,86,22,88],[21,89,22,90],[21,91,22,92],[21,93,22,95],[21,96,22,97],[21,98,22,100],[17,135,18,137],[17,138,18,148],[19,75,20,81],[19,82,20,83],[19,84,20,85],[19,86,20,88],[19,89,20,90],[19,91,20,92],[19,93,20,95],[19,96,20,97],[19,98,20,100],[19,101,20,111],[19,112,20,118],[19,119,20,120],[19,121,20,122],[19,123,20,125],[19,126,20,127],[19,128,20,129],[19,130,20,132],[19,133,20,134],[19,135,20,137],[19,138,20,148],[17,101,18,111],[17,112,18,118],[17,119,18,120],[17,121,18,122],[17,123,18,125],[17,126,18,127],[17,128,18,129],[17,130,18,132],[17,133,18,134],[17,75,18,81],[17,82,18,83],[17,84,18,85],[17,86,18,88],[17,89,18,90],[17,91,18,92],[17,93,18,95],[17,96,18,97],[17,98,18,100],[13,135,14,137],[13,138,14,148],[15,75,16,81],[15,82,16,83],[15,84,16,85],[15,86,16,88],[15,89,16,90],[15,91,16,92],[15,93,16,95],[15,96,16,97],[15,98,16,100],[15,101,16,111],[15,112,16,118],[15,119,16,120],[15,121,16,122],[15,123,16,125],[15,126,16,127],[15,128,16,129],[15,130,16,132],[15,133,16,134],[15,135,16,137],[15,138,16,148],[13,101,14,111],[13,112,14,118],[13,119,14,120],[13,121,14,122],[13,123,14,125],[13,126,14,127],[13,128,14,129],[13,130,14,132],[13,133,14,134],[13,75,14,81],[13,82,14,83],[13,84,14,85],[13,86,14,88],[13,89,14,90],[13,91,14,92],[13,93,14,95],[13,96,14,97],[13,98,14,100],[9,135,10,137],[9,138,10,148],[11,75,12,81],[11,82,12,83],[11,84,12,85],[11,86,12,88],[11,89,12,90],[11,91,12,92],[11,93,12,95],[11,96,12,97],[11,98,12,100],[11,101,12,111],[11,112,12,118],[11,119,12,120],[11,121,12,122],[11,123,12,125],[11,126,12,127],[11,128,12,129],[11,130,12,132],[11,133,12,134],[11,135,12,137],[11,138,12,148],[9,101,10,111],[9,112,10,118],[9,119,10,120],[9,121,10,122],[9,123,10,125],[9,126,10,127],[9,128,10,129],[9,130,10,132],[9,133,10,134],[9,75,10,81],[9,82,10,83],[9,84,10,85],[9,86,10,88],[9,89,10,90],[9,91,10,92],[9,93,10,95],[9,96,10,97],[9,98,10,100],[5,135,6,137],[5,138,6,148],[7,75,8,81],[7,82,8,83],[7,84,8,85],[7,86,8,88],[7,89,8,90],[7,91,8,92],[7,93,8,95],[7,96,8,97],[7,98,8,100],[7,101,8,111],[7,112,8,118],[7,119,8,120],[7,121,8,122],[7,123,8,125],[7,126,8,127],[7,128,8,129],[7,130,8,132],[7,133,8,134],[7,135,8,137],[7,138,8,148],[5,101,6,111],[5,112,6,118],[5,119,6,120],[5,121,6,122],[5,123,6,125],[5,126,6,127],[5,128,6,129],[5,130,6,132],[5,133,6,134],[5,75,6,81],[5,82,6,83],[5,84,6,85],[5,86,6,88],[5,89,6,90],[5,91,6,92],[5,93,6,95],[5,96,6,97],[5,98,6,100],[1,75,2,148],[3,75,4,81],[3,82,4,83],[3,84,4,85],[3,86,4,88],[3,89,4,90],[3,91,4,92],[3,93,4,95],[3,96,4,97],[3,98,4,100],[3,101,4,111],[3,112,4,118],[3,119,4,120],[3,121,4,122],[3,123,4,125],[3,126,4,127],[3,128,4,129],[3,130,4,132],[3,133,4,134],[3,135,4,137],[3,138,4,148],[23,38,24,44],[23,45,24,46],[23,47,24,48],[23,49,24,51],[23,52,24,53],[23,54,24,55],[23,56,24,58],[23,59,24,60],[21,47,22,48],[21,49,22,51],[21,52,22,53],[21,54,22,55],[21,56,22,58],[21,59,22,60],[23,61,24,63],[23,64,24,74],[21,61,22,63],[21,64,22,74],[25,61,26,63],[25,64,26,74],[17,38,18,44],[17,45,18,46],[17,47,18,48],[17,49,18,51],[17,52,18,53],[17,54,18,55],[17,56,18,58],[17,59,18,60],[25,47,26,48],[25,49,26,51],[25,52,26,53],[25,54,26,55],[25,56,26,58],[25,59,26,60],[19,56,20,58],[19,59,20,60],[19,61,20,63],[19,64,20,74],[17,61,18,63],[17,64,18,74],[21,38,22,44],[21,45,22,46],[39,27,40,37],[25,38,26,44],[25,45,26,46],[37,19,38,21],[37,22,38,23],[37,24,38,26],[37,27,38,37],[35,27,36,37],[33,19,34,21],[33,22,34,23],[33,24,34,26],[33,27,34,37],[31,19,32,21],[31,22,32,23],[31,24,32,26],[31,27,32,37],[29,27,30,37],[33,38,34,44],[33,45,34,46],[35,56,36,58],[39,1,40,7],[39,8,40,9],[39,10,40,11],[39,12,40,14],[39,15,40,16],[39,17,40,18],[35,19,36,21],[35,22,36,23],[35,24,36,26],[37,1,38,7],[37,8,38,9],[37,10,38,11],[37,12,38,14],[37,15,38,16],[37,17,38,18],[35,1,36,7],[35,8,36,9],[35,10,36,11],[35,12,36,14],[35,15,36,16],[35,17,36,18],[39,19,40,21],[39,22,40,23],[39,24,40,26],[27,64,28,74],[33,1,34,7],[33,8,34,9],[33,10,34,11],[33,12,34,14],[33,15,34,16],[33,17,34,18],[29,19,30,21],[29,22,30,23],[29,24,30,26],[31,1,32,7],[31,8,32,9],[31,10,32,11],[31,12,32,14],[31,15,32,16],[31,17,32,18],[29,1,30,7],[29,8,30,9],[29,10,30,11],[29,12,30,14],[29,15,30,16],[29,17,30,18],[33,47,34,48],[33,49,34,51],[33,52,34,53],[33,54,34,55],[35,59,36,60],[35,61,36,63],[35,64,36,74],[19,38,20,44],[19,45,20,46],[19,47,20,48],[19,49,20,51],[19,52,20,53],[19,54,20,55],[33,56,34,58],[33,59,34,60],[33,61,34,63],[33,64,34,74],[35,38,36,44],[35,45,36,46],[35,47,36,48],[35,49,36,51],[35,52,36,53],[35,54,36,55],[31,56,32,58],[29,56,30,58],[29,59,30,60],[29,61,30,63],[29,64,30,74],[31,38,32,44],[31,45,32,46],[31,47,32,48],[31,49,32,51],[31,52,32,53],[31,54,32,55],[29,38,30,44],[29,45,30,46],[29,47,30,48],[29,49,30,51],[29,52,30,53],[29,54,30,55],[31,59,32,60],[31,61,32,63],[31,64,32,74],[27,38,28,44],[27,45,28,46],[27,47,28,48],[27,49,28,51],[27,52,28,53],[27,54,28,55],[27,56,28,58],[27,59,28,60],[27,61,28,63],[13,64,14,74],[15,38,16,44],[15,45,16,46],[15,47,16,48],[15,49,16,51],[15,52,16,53],[15,54,16,55],[15,56,16,58],[15,59,16,60],[15,61,16,63],[15,64,16,74],[13,38,14,44],[13,45,14,46],[13,47,14,48],[13,49,14,51],[13,52,14,53],[13,54,14,55],[13,56,14,58],[13,59,14,60],[13,61,14,63],[9,64,10,74],[11,38,12,44],[11,45,12,46],[11,47,12,48],[11,49,12,51],[11,52,12,53],[11,54,12,55],[11,56,12,58],[11,59,12,60],[11,61,12,63],[11,64,12,74],[9,38,10,44],[9,45,10,46],[9,47,10,48],[9,49,10,51],[9,52,10,53],[9,54,10,55],[9,56,10,58],[9,59,10,60],[9,61,10,63],[5,61,6,63],[5,64,6,74],[7,38,8,44],[7,45,8,46],[7,47,8,48],[7,49,8,51],[7,52,8,53],[7,54,8,55],[5,38,6,44],[5,45,6,46],[5,47,6,48],[5,49,6,51],[5,52,6,53],[5,54,6,55],[7,56,8,58],[7,59,8,60],[7,61,8,63],[7,64,8,74],[3,52,4,53],[3,54,4,55],[3,56,4,58],[3,59,4,60],[3,61,4,63],[3,64,4,74],[27,17,28,18],[27,19,28,21],[27,22,28,23],[27,24,28,26],[27,27,28,37],[13,22,14,23],[13,24,14,26],[13,27,14,37],[11,17,12,18],[11,19,12,21],[11,22,12,23],[11,24,12,26],[11,27,12,37],[7,27,8,37],[9,27,10,37],[17,27,18,37],[5,56,6,58],[5,59,6,60],[1,38,2,74],[3,38,4,44],[3,45,4,46],[3,47,4,48],[3,49,4,51],[25,17,26,18],[25,19,26,21],[25,22,26,23],[25,24,26,26],[25,27,26,37],[23,27,24,37],[21,17,22,18],[21,19,22,21],[21,22,22,23],[21,24,22,26],[21,27,22,37],[19,17,20,18],[19,19,20,21],[19,22,20,23],[19,24,20,26],[19,27,20,37],[15,27,16,37],[13,17,14,18],[13,19,14,21],[27,1,28,7],[27,8,28,9],[27,10,28,11],[27,12,28,14],[27,15,28,16],[23,17,24,18],[23,19,24,21],[23,22,24,23],[23,24,24,26],[25,1,26,7],[25,8,26,9],[25,10,26,11],[25,12,26,14],[25,15,26,16],[23,1,24,7],[23,8,24,9],[23,10,24,11],[23,12,24,14],[23,15,24,16],[15,17,16,18],[15,19,16,21],[15,22,16,23],[15,24,16,26],[19,1,20,7],[19,8,20,9],[19,10,20,11],[19,12,20,14],[19,15,20,16],[15,1,16,7],[15,8,16,9],[15,10,16,11],[15,12,16,14],[15,15,16,16],[17,17,18,18],[17,19,18,21],[17,22,18,23],[17,24,18,26],[7,8,8,9],[7,10,8,11],[7,12,8,14],[7,15,8,16],[9,1,10,7],[21,1,22,7],[21,8,22,9],[21,10,22,11],[21,12,22,14],[21,15,22,16],[9,15,10,16],[5,17,6,18],[5,19,6,21],[5,22,6,23],[5,24,6,26],[5,27,6,37],[13,1,14,7],[13,8,14,9],[13,10,14,11],[13,12,14,14],[13,15,14,16],[7,17,8,18],[7,19,8,21],[7,22,8,23],[7,24,8,26],[11,1,12,7],[11,8,12,9],[11,10,12,11],[11,12,12,14],[11,15,12,16],[9,17,10,18],[9,19,10,21],[9,22,10,23],[9,24,10,26],[7,1,8,7],[1,1,2,37],[17,1,18,7],[17,8,18,9],[17,10,18,11],[17,12,18,14],[17,15,18,16],[3,1,4,7],[3,8,4,9],[3,10,4,11],[3,12,4,14],[3,15,4,16],[3,17,4,18],[5,1,6,7],[5,8,6,9],[5,10,6,11],[5,12,6,14],[5,15,6,16],[3,19,4,21],[3,22,4,23],[3,24,4,26],[3,27,4,37],[9,8,10,9],[9,10,10,11],[9,12,10,14],[41,27,42,37],[43,1,44,7],[43,8,44,9],[43,10,44,11],[43,12,44,14],[43,15,44,16],[43,17,44,18],[43,19,44,21],[43,22,44,23],[43,24,44,26],[43,27,44,37],[41,1,42,7],[41,8,42,9],[41,10,42,11],[41,12,42,14],[41,15,42,16],[41,17,42,18],[41,19,42,21],[41,22,42,23],[41,24,42,26],[37,64,38,74],[39,38,40,44],[39,45,40,46],[39,47,40,48],[39,49,40,51],[39,52,40,53],[39,54,40,55],[39,56,40,58],[39,59,40,60],[39,61,40,63],[39,64,40,74],[37,38,38,44],[37,45,38,46],[37,47,38,48],[37,49,38,51],[37,52,38,53],[37,54,38,55],[37,56,38,58],[37,59,38,60],[37,61,38,63],[47,138,48,148],[49,112,50,118],[49,119,50,120],[49,121,50,122],[49,123,50,125],[49,126,50,127],[49,128,50,129],[49,130,50,132],[49,133,50,134],[49,135,50,137],[49,138,50,148],[47,112,48,118],[47,119,48,120],[47,121,48,122],[47,123,48,125],[47,126,48,127],[47,128,48,129],[47,130,48,132],[47,133,48,134],[47,135,48,137],[51,138,52,148],[53,112,54,118],[53,119,54,120],[53,121,54,122],[53,123,54,125],[53,126,54,127],[53,128,54,129],[53,130,54,132],[53,133,54,134],[53,135,54,137],[53,138,54,148],[51,112,52,118],[51,119,52,120],[51,121,52,122],[51,123,52,125],[51,126,52,127],[51,128,52,129],[51,130,52,132],[51,133,52,134],[51,135,52,137]]}
[]
[null,"良く使用する汎用スキル1 (コピペ用)",null,null,null,null,null,null,null,null,null,null,null,null,null,null,null,null,null,null,null,null,null,null,null,null,null,null,null,null,null,null,null,null,null,null,null,null,"良く使用する汎用スキル2 (コピペ用)",null,null,null,null,null,null,null,null,null,null,null,null,null,null,null,null,null,null,null,null,null,null,null,null,null,null,null,null,null,null,null,null,null,null,null,null,"良く使用するスキル3 (常時フォース系スキル)"]
[]
[null,"名称",null,null,null,null,null,null,"SL",null,"種別",null,"ﾀｲﾐﾝｸﾞ",null,null,"対象",null,"射程",null,"判定値",null,null,"代償",null,"コスト",null,null,"効果 (SL参照などは自動計算)",null,null,null,null,null,null,null,null,null,null,"名称",null,null,null,null,null,null,"SL",null,"種別",null,"ﾀｲﾐﾝｸﾞ",null,null,"対象",null,"射程",null,"判定値",null,null,"代償",null,"コスト",null,null,"効果 (SL参照などは自動計算)",null,null,null,null,null,null,null,null,null,null,"名称",null,null,null,null,null,null,"SL",null,"種別",null,"ﾀｲﾐﾝｸﾞ",null,null,"対象",null,"射程",null,"判定値",null,null,"代償",null,"コスト",null,null,"効果 (SL参照などは自動計算)",null,null,null,null,null,null,null,null,null,null,"名称",null,null,null,null,null,null,"SL",null,"種別",null,"ﾀｲﾐﾝｸﾞ",null,null,"対象",null,"射程",null,"判定値",null,null,"代償",null,"コスト",null,null,"効果 (SL参照などは自動計算)"]
[]
[null,"アタックフォース",null,null,null,null,null,null,null,null,"なし",null,"常時",null,null,"自身",null,"なし",null,null,null,null,null,null,null,null,null,{"$f":"\"【近接】+\"&QUOTIENT(I6,2)&\" 【物攻】+\"&I6","v":"【近接】+0 【物攻】+"},null,null,null,null,null,null,null,null,null,null,"セカンドチャンス",null,null,null,null,null,null,null,null,"支",null,"オート",null,null,"自身",null,"なし",null,"自動",null,null,"2MP",null,2,null,null,{"$f":"\"振り直し。 戦闘外では使用毎にF値+4 (Max14)　1判定\"&AT6&\"回\"","v":"振り直し。 戦闘外では使用毎にF値+4 (Max14)　1判定回"},null,null,null,null,null,null,null,null,null,null,"ファイアフォース",null,null,null,null,null,null,null,null,"なし",null,"常時",null,null,"自身",null,"なし",null,null,null,null,null,null,null,null,null,{"$f":"\"炎ｽｷﾙダメージ+\"&CE6*3&\"　炎光耐性+\"&CE6*3&\" \"&IF(CE6<20,,\"FSﾒｲﾝｺｽﾄ-1\")","v":"炎ｽｷﾙダメージ+0　炎光耐性+0 "},null,null,null,null,null,null,null,null,null,null,"カオスフォース",null,null,null,null,null,null,null,null,"なし",null,"常時",null,null,"自身",null,"なし",null,null,null,null,null,null,null,null,null,{"$f":"\"CRｽｷﾙor「範囲」ｽｷﾙD+\"&DP6*3&\" CHRを1ｾｯｼｮﾝ\"&ROUNDUP(DP6/5,0)&\"回振り直せる\"","v":"CRｽｷﾙor「範囲」ｽｷﾙD+0 CHRを1ｾｯｼｮﾝ0回振り直せる"}]
[]
[null,"ショットフォース",null,null,null,null,null,null,null,null,"なし",null,"常時",null,null,"自身",null,"なし",null,null,null,null,null,null,null,null,null,{"$f":"\"【射撃】+\"&QUOTIENT(I8,2)&\" 【物攻】+\"&I8","v":"【射撃】+0 【物攻】+"},null,null,null,null,null,null,null,null,null,null,"サポートムーブ",null,null,null,null,null,null,null,null,"支",null,"オート",null,null,"単体",null,"0-1",null,"自動",null,null,{"$f":"AT8+5&\"MP\"","v":"5MP"},null,2,null,null,{"$f":"\"判定直後に使用。達成値+\"&AT8&\"\n1ﾒｲﾝｱｸｼｮﾝ1回\"","v":"判定直後に使用。達成値+\n1ﾒｲﾝｱｸｼｮﾝ1回"},null,null,null,null,null,null,null,null,null,null,"フリーズフォース",null,null,null,null,null,null,null,null,"なし",null,"常時",null,null,"自身",null,"なし",null,null,null,null,null,null,null,null,null,{"$f":"\"氷ｽｷﾙダメージ+\"&CE8*3&\"　氷風耐性+\"&CE8*3&\" \"&IF(CE8<20,,\"BS不動無効\")","v":"氷ｽｷﾙダメージ+0　氷風耐性+0 "},null,null,null,null,null,null,null,null,null,null,"マインドフォース",null,null,null,null,null,null,null,null,"なし",null,"常時",null,null,"自身",null,"なし",null,null,null,null,null,null,null,null,null,{"$f":"\"BS付与確定時、ｽｷﾙ与D+\"&DP8*3&\"　【耐久力】-\"&DP8*6&\" 【精神力】+\"&DP8*3","v":"BS付与確定時、ｽｷﾙ与D+0　【耐久力】-0 【精神力】+0"}]
[]
[null,"マジックフォース",null,null,null,null,null,null,null,null,"なし",null,"常時",null,null,"自身",null,"なし",null,null,null,null,null,null,null,null,null,{"$f":"\"【魔術】+\"&QUOTIENT(I10,2)&\" 【魔攻】+\"&I10","v":"【魔術】+0 【魔攻】+"},null,null,null,null,null,null,null,null,null,null,"ジャミング",null,null,null,null,null,null,null,null,"なし",null,"オート",null,null,"単体",null,"1-3",null,"自動",null,null,{"$f":"AT10+6&\"MP\"","v":"6MP"},null,2,null,null,{"$f":"\"判定直後に使用。達成値-\"&AT10&\"\n1ﾒｲﾝｱｸｼｮﾝ1回\"","v":"判定直後に使用。達成値-\n1ﾒｲﾝｱｸｼｮﾝ1回"},null,null,null,null,null,null,null,null,null,null,"アルカナクリエイト",null,null,null,null,null,null,null,null,"なし",null,"サブ",null,null,"自身",null,"なし",null,"自動",null,null,"2MP",null,2,null,null,{"$f":"\"AC+1 直後ﾒｲﾝでAC使用時 与D+\"&CE10*3&\" 【精神力】+\"&CE10","v":"AC+1 直後ﾒｲﾝでAC使用時 与D+0 【精神力】+"},null,null,null,null,null,null,null,null,null,null,"ツールフォース",null,null,null,null,null,null,null,null,"なし",null,"常時",null,null,"自身",null,"なし",null,null,null,null,null,null,null,null,null,{"$f":"\"ｱｲﾃﾑ使用した手番の与D+\"&DP10&\"D6 \"&IF(DP10<10,,\"回避CでI生成Rを1度振れる\")","v":"ｱｲﾃﾑ使用した手番の与D+D6 "}]
[]
[null,"タフネスフォース",null,null,null,null,null,null,null,null,"なし",null,"常時",null,null,"自身",null,"なし",null,null,null,null,null,null,null,null,null,{"$f":"\"【耐久力】+\"&I12*10","v":"【耐久力】+0"},null,null,null,null,null,null,null,null,null,null,"チャージング",null,null,null,null,null,null,null,null,"なし",null,"サブ",null,null,"自身",null,"なし",null,"自動",null,null,"2MP",null,2,null,null,{"$f":"\"次ﾒｲﾝｽｷｯﾌﾟ。 次ｽｷﾙのｺｽﾄ-2\n連続\"&AT12&\"回まで使用可\"","v":"次ﾒｲﾝｽｷｯﾌﾟ。 次ｽｷﾙのｺｽﾄ-2\n連続回まで使用可"},null,null,null,null,null,null,null,null,null,null,"ウィンドフォース",null,null,null,null,null,null,null,null,"なし",null,"常時",null,null,"自身",null,"なし",null,null,null,null,null,null,null,null,null,{"$f":"\"風ｽｷﾙダメージ+\"&CE12*3&\"　【敏捷】+\"&ROUNDUP(CE12/3,0)&\" \"&IF(CE12<20,,\"移動ｺｽﾄ-1 (min:1)\")","v":"風ｽｷﾙダメージ+0　【敏捷】+0 "},null,null,null,null,null,null,null,null,null,null,"レーザーフォース",null,null,null,null,null,null,null,null,"なし",null,"常時",null,null,"自身",null,"なし",null,null,null,null,null,null,null,null,null,{"$f":"\"光ｽｷﾙダメージ+\"&DP12*3&\" \"&IF(DP12<20,,\"LSのｸﾗｽ特典を2-4にする\")","v":"光ｽｷﾙダメージ+0 "}]
[]
[null,"メンタルフォース",null,null,null,null,null,null,null,null,"なし",null,"常時",null,null,"自身",null,"なし",null,null,null,null,null,null,null,null,null,{"$f":"\"【精神力】+\"&I14*6","v":"【精神力】+0"},null,null,null,null,null,null,null,null,null,null,"カバーリング",null,null,null,null,null,null,0,null,"なし",null,"ダメロ",null,null,"単体",null,"0-0",null,"自動",null,null,"2MP",null,1,null,null,"ﾀﾞﾒﾛ前使用。ﾀﾞﾒｰｼﾞを代わりに受ける。1ﾒｲﾝｱｸｼｮﾝ2回",null,null,null,null,null,null,null,null,null,null,"ブラッドフォース",null,null,null,null,null,null,null,null,"なし",null,"常時",null,null,"自身",null,"なし",null,null,null,null,null,null,null,null,null,{"$f":"\"HP-\"&CE14&\"して射撃ﾀﾞﾒｰｼﾞ+\"&CE14*2&\"可能　対象が被呪印時さらに+\"&CE14*3&\"。\"","v":"HP-して射撃ﾀﾞﾒｰｼﾞ+0可能　対象が被呪印時さらに+0。"},null,null,null,null,null,null,null,null,null,null,"エンハンスフォース",null,null,null,null,null,null,null,null,"なし",null,"常時",null,null,"自身",null,"なし",null,null,null,null,null,null,null,null,null,{"$f":"\"「支」ｽｷﾙ適用時 与D+\"&DP14*3&\" 自身の「支」ｽｷﾙ持続C+\"&QUOTIENT(DP14+CL,3)","v":"「支」ｽｷﾙ適用時 与D+0 自身の「支」ｽｷﾙ持続C+0"}]
[]
[null,"クイックフォース",null,null,null,null,null,null,null,null,"なし",null,"常時",null,null,"自身",null,"なし",null,null,null,null,null,null,null,null,null,{"$f":"\"【敏捷】+\"&I16*2","v":"【敏捷】+0"},null,null,null,null,null,null,null,null,null,null,"ロングレンジカバー",null,null,null,null,null,null,0,null,"なし",null,"ダメロ",null,null,"単体",null,"0-1",null,"自動",null,null,"4MP",null,2,null,null,"ﾀﾞﾒﾛ前使用。ﾀﾞﾒｰｼﾞを代わりに受ける。1ﾒｲﾝｱｸｼｮﾝ2回",null,null,null,null,null,null,null,null,null,null,"ヴォイドフォース",null,null,null,null,null,null,null,null,"なし",null,"常時",null,null,"自身",null,"なし",null,null,null,null,null,null,null,null,null,{"$f":"\"VCｽｷﾙor「魔&N体」ｽｷﾙのﾀﾞﾒｰｼﾞ+\"&CE16*3&\"、命中時 即死(\"&CE16*3&\")付与可。\"","v":"VCｽｷﾙor「魔&N体」ｽｷﾙのﾀﾞﾒｰｼﾞ+0、命中時 即死(0)付与可。"},null,null,null,null,null,null,null,null,null,null,"忍術フォース",null,null,null,null,null,null,null,null,"なし",null,"常時",null,null,"自身",null,"なし",null,null,null,null,null,null,null,null,null,{"$f":"\"ｻﾌﾞ未消費でのｽｷﾙﾀﾞﾒｰｼﾞ+\"&DP16&\"D6 炎～土耐性+\"&DP16+CL","v":"ｻﾌﾞ未消費でのｽｷﾙﾀﾞﾒｰｼﾞ+D6 炎～土耐性+1"}]
[]
[null,"ヒールフォース",null,null,null,null,null,null,null,null,"なし",null,"常時",null,null,"自身",null,"なし",null,null,null,null,null,null,null,null,null,{"$f":"IF(CL<5,\"「種別：回」ｽｷﾙの回復量+\"&ROUNDUP(CS!$AI$39/2,0)+I18*3&\"、代償に-\"&QUOTIENT(I18,5)&\"MP (下限値：2MP)\",\"「種別：回」ｽｷﾙの回復量+\"&CS!$AI$39+I18*3&\"、代償に-\"&QUOTIENT(I18,5)&\"MP (下限値：2MP)\")","v":"「種別：回」ｽｷﾙの回復量+9、代償に-0MP (下限値：2MP)"},null,null,null,null,null,null,null,null,null,null,"リフレッシング",null,null,null,null,null,null,null,null,"なし",null,"サブ",null,null,"単体",null,{"$f":"\"0-\"&AT18","v":"0-"},null,"自動",null,null,"10MP",null,3,null,null,{"$f":"IF(AT18<3,\"対象の毒、眠り、恐怖、凍結を解除。\",IF(AT18<5,\"対象の毒、眠り、恐怖、凍結、麻痺、封印、呪いを解除。\",\"対象の全てのﾊﾞｯﾄﾞｽﾃｰﾀｽを解除。\"))","v":"対象の毒、眠り、恐怖、凍結を解除。"},null,null,null,null,null,null,null,null,null,null,"テトラフォース",null,null,null,null,null,null,null,null,"なし",null,"常時",null,null,"自身",null,"なし",null,null,null,null,null,null,null,null,null,{"$f":"\"炎水風土ﾀﾞﾒｰｼﾞ+\"&CE18*2&\"、炎水風土耐性+\"&CE18&\" \"&IF(CE18<15,,\"20%で専攻属性Dを0\")","v":"炎水風土ﾀﾞﾒｰｼﾞ+0、炎水風土耐性+ "},null,null,null,null,null,null,null,null,null,null,"ドールフォース",null,null,null,null,null,null,null,null,"なし",null,"常時",null,null,"自身",null,"なし",null,null,null,null,null,null,null,null,null,{"$f":"\"ｽｷﾙﾀﾞﾒｰｼﾞ+[N*\"&DP18&\"] N：同ﾏｽの人形数 自身の「人形」ｽｷﾙSL+\"&QUOTIENT(DP18,3)","v":"ｽｷﾙﾀﾞﾒｰｼﾞ+[N*] N：同ﾏｽの人形数 自身の「人形」ｽｷﾙSL+0"}]
[]
[null,"回避ブースト",null,null,null,null,null,null,null,null,"なし",null,"常時",null,null,"自身",null,"なし",null,null,null,null,null,null,null,null,null,{"$f":"\"【回避値】+\"&QUOTIENT(I20,2)","v":"【回避値】+0"},null,null,null,null,null,null,null,null,null,null,"延長化魔術",null,null,null,null,null,null,null,null,"なし",null,"サブ",null,null,"自身",null,"なし",null,"自動",null,null,{"$f":"5-AT20&\"MP\"","v":"5MP"},null,1,null,null,"次ﾒｲﾝでの「種別：魔」ｽｷﾙの最大射程に+1",null,null,null,null,null,null,null,null,null,null,"トリックフォース",null,null,null,null,null,null,null,null,"なし",null,"常時",null,null,"自身",null,"なし",null,null,null,null,null,null,null,null,null,{"$f":"\"「ﾄ」使用で､TC+1。 命中+[TC/4](↓) 与D+[\"&CE20+5&\"+TC*\"&CE20&\"/3(↓)]\"","v":"「ﾄ」使用で､TC+1。 命中+[TC/4](↓) 与D+[5+TC*/3(↓)]"},null,null,null,null,null,null,null,null,null,null,"ダークネスフォース",null,null,null,null,null,null,null,null,"なし",null,"常時",null,null,"自身",null,"なし",null,null,null,null,null,null,null,null,null,{"$f":"\"闇ｽｷﾙダメージ+\"&DP20*3&\" 光闇耐性+\"&DP20*2&\" \"&IF(DP20<15,,\"ﾒｲﾝｽｷﾙ最大射程+1\")","v":"闇ｽｷﾙダメージ+0 光闇耐性+0 "}]
[]
[null,"抵抗ブースト",null,null,null,null,null,null,null,null,"なし",null,"常時",null,null,"自身",null,"なし",null,null,null,null,null,null,null,null,null,{"$f":"\"【抵抗値】+\"&QUOTIENT(I22,2)","v":"【抵抗値】+0"},null,null,null,null,null,null,null,null,null,null,"戦闘集中",null,null,null,null,null,null,null,null,"支",null,"サブ",null,null,"自身",null,"なし",null,"自動",null,null,{"$f":"5-AT22&\"MP\"","v":"5MP"},null,2,null,null,{"$f":"\"次に行う命中達成値+2\n与えるダメージに+\"&ROUNDUP(CS!$E$18/3,0)","v":"次に行う命中達成値+2\n与えるダメージに+0"},null,null,null,null,null,null,null,null,null,null,"エレクトロフォース",null,null,null,null,null,null,null,null,"なし",null,"常時",null,null,"自身",null,"なし",null,null,null,null,null,null,null,null,null,{"$f":"\"雷ｽｷﾙダメージ+\"&CE22*3&\"　雷光耐性+\"&CE22*3&\" \"&IF(CE22<20,,\"EEﾒｲﾝｺｽﾄ-1\")","v":"雷ｽｷﾙダメージ+0　雷光耐性+0 "},null,null,null,null,null,null,null,null,null,null,"禁じられし魔術",null,null,null,null,null,null,null,null,"なし",null,"常時",null,null,"自身",null,"なし",null,null,null,null,null,null,null,null,null,{"$f":"\"「禁」ｽｷﾙのSLを+\"&DP22&\"して扱う。 ｽﾀｰﾄ終了時 禁C+\"&DP22&\" 最大：\"&DP22*2+5&\"個\"","v":"「禁」ｽｷﾙのSLを+して扱う。 ｽﾀｰﾄ終了時 禁C+ 最大：5個"}]
[]
[null,"ウェポンマスター",null,null,null,null,null,null,null,null,"なし",null,"常時",null,null,"自身",null,"なし",null,null,null,null,null,null,null,null,null,"「近接武器」or「射撃武器」の攻撃の命中C値-1 (下限値：17)",null,null,null,null,null,null,null,null,null,null,"力溜め",null,null,null,null,null,null,null,null,"支",null,"サブ",null,null,"自身",null,"なし",null,"自動",null,null,{"$f":"5-AT24&\"MP\"","v":"5MP"},null,3,null,null,{"$f":"\"次に攻撃で与えるダメージ+\"&CS!$B$18*2&\"\n1戦闘\"&AT24&\"回\"","v":"次に攻撃で与えるダメージ+0\n1戦闘回"},null,null,null,null,null,null,null,null,null,null,"アトミックフォース",null,null,null,null,null,null,null,null,"なし",null,"常時",null,null,"自身",null,"なし",null,null,null,null,null,null,null,null,null,{"$f":"\"「0-2」攻撃ﾀﾞﾒｰｼﾞ+\"&CE24*2&\" 炎光無ｽｷﾙﾀﾞﾒｰｼﾞ+\"&CE24*2","v":"「0-2」攻撃ﾀﾞﾒｰｼﾞ+0 炎光無ｽｷﾙﾀﾞﾒｰｼﾞ+0"},null,null,null,null,null,null,null,null,null,null,"バリアフォース",null,null,null,null,null,null,null,null,"なし",null,"常時",null,null,"自身",null,"なし",null,null,null,null,null,null,null,null,null,{"$f":"\"非B状態時 ｽｷﾙD+\"&DP24*3&\" B状態時 被ｽｷﾙD-\"&DP24*2&\" & 命中達成値-3\"","v":"非B状態時 ｽｷﾙD+0 B状態時 被ｽｷﾙD-0 & 命中達成値-3"}]
[]
[null,"マジックマスター",null,null,null,null,null,null,null,null,"なし",null,"常時",null,null,"自身",null,"なし",null,null,null,null,null,null,null,null,null,"「種別：魔」かつ「対象：単体」の攻撃の命中C値-1 (下限値：17)",null,null,null,null,null,null,null,null,null,null,"至近発動",null,null,null,null,null,null,null,null,"支",null,"サブ",null,null,"自身",null,"なし",null,"自動",null,null,"8MP",null,{"$f":"4-AT26","v":4},null,null,"次ﾒｲﾝでの「種別：魔」単体ｽｷﾙの最低射程を0に。",null,null,null,null,null,null,null,null,null,null,"バトルフォース",null,null,null,null,null,null,null,null,"なし",null,"常時",null,null,"自身",null,"なし",null,null,null,null,null,null,null,null,null,{"$f":"\"ｽｷﾙ攻撃ﾀﾞﾒｰｼﾞ+[(N+1)*\"&CE26&\"]\nN：同ｶｳﾝﾄのﾕﾆｯﾄ数 max:5\"","v":"ｽｷﾙ攻撃ﾀﾞﾒｰｼﾞ+[(N+1)*]\nN：同ｶｳﾝﾄのﾕﾆｯﾄ数 max:5"},null,null,null,null,null,null,null,null,null,null,"ライドフォース",null,null,null,null,null,null,null,null,"なし",null,"常時",null,null,"自身",null,"なし",null,null,null,null,null,null,null,null,null,{"$f":"\"騎乗状態時ｽｷﾙD+\"&DP26*3&\" 幻獣【耐久力】+\"&DP26*5&\" 幻撃達成値+\"&ROUNDUP(DP26/4,0)","v":"騎乗状態時ｽｷﾙD+0 幻獣【耐久力】+0 幻撃達成値+0"}]
[]
[null,"BS耐性",null,null,null,null,null,null,null,null,"なし",null,"常時",null,null,"自身",null,"なし",null,null,null,null,null,null,null,null,null,"を受けるとき、1D10で3以上で無効。",null,null,null,null,null,null,null,null,null,null,"スペルブレイク",null,null,null,null,null,null,null,null,"なし",null,"オート",null,null,"自身",null,"なし",null,"自動",null,null,"2BP",null,3,null,null,{"$f":"\"25MPでも可。「種別：魔」を3D6 \"&14-AT28&\"以上で〈無〉\"&CL&\"D6点に\"","v":"25MPでも可。「種別：魔」を3D6 14以上で〈無〉1D6点に"},null,null,null,null,null,null,null,null,null,null,"パルスフォース",null,null,null,null,null,null,null,null,"なし",null,"常時",null,null,"自身",null,"なし",null,null,null,null,null,null,null,null,null,{"$f":"\"「音」ｽｷﾙﾀﾞﾒｰｼﾞ+\"&CE28*3&\" 3ﾏｽ以上からのﾀﾞﾒｰｼﾞ-\"&CE28*3&\" \"&IF(CE28<15,,\"全ｻﾌﾞｽｷﾙ「0-5」\")","v":"「音」ｽｷﾙﾀﾞﾒｰｼﾞ+0 3ﾏｽ以上からのﾀﾞﾒｰｼﾞ-0 "},null,null,null,null,null,null,null,null,null,null,"プラントフォース",null,null,null,null,null,null,null,null,"なし",null,"常時",null,null,"自身",null,"なし",null,null,null,null,null,null,null,null,null,{"$f":"\"毒or麻痺付与確定時、ﾀﾞﾒｰｼﾞ+\"&DP28*3&\" 土光耐性+\"&DP28*3","v":"毒or麻痺付与確定時、ﾀﾞﾒｰｼﾞ+0 土光耐性+0"}]
[]
[null,"物理障壁",null,null,null,null,null,null,null,null,"なし",null,"常時",null,null,"自身",null,"なし",null,null,null,null,null,null,null,null,null,{"$f":"\"〈近〉〈遠〉耐性+\"&I30*3+3","v":"〈近〉〈遠〉耐性+3"},null,null,null,null,null,null,null,null,null,null,"チャンスブレイク",null,null,null,null,null,null,0,null,"なし",null,"オート",null,null,"単体",null,"0-3",null,"自動",null,null,"2BP",null,0,null,null,"判定振り直し効果を無効。\nその後の振り直し不可。",null,null,null,null,null,null,null,null,null,null,"アルカナストライク",null,null,null,null,null,null,null,null,"なし",null,"オート",null,null,"自身",null,"なし",null,"自動",null,null,"4MP",null,0,null,null,{"$f":"\"AC消費攻撃の判定前使用。与D+\"&CE30*4&\" C値-2 (min:14) C時、AC+1\"","v":"AC消費攻撃の判定前使用。与D+0 C値-2 (min:14) C時、AC+1"},null,null,null,null,null,null,null,null,null,null,"アストラルフォース",null,null,null,null,null,null,null,null,"なし",null,"常時",null,null,"自身",null,"なし",null,null,null,null,null,null,null,null,null,{"$f":"\"AWor「単体」ｽｷﾙﾀﾞﾒｰｼﾞ+\"&DP30*3&\" 【耐久力】+\"&DP30*2&\" 【精神力】+\"&DP30","v":"AWor「単体」ｽｷﾙﾀﾞﾒｰｼﾞ+0 【耐久力】+0 【精神力】+"}]
[]
[null,"属性障壁",null,null,null,null,null,null,null,null,"なし",null,"常時",null,null,"自身",null,"なし",null,null,null,null,null,null,null,null,null,{"$f":"\"〈炎〉～〈土〉耐性+\"&I32+1","v":"〈炎〉～〈土〉耐性+1"},null,null,null,null,null,null,null,null,null,null,"スプレッドパワー",null,null,null,null,null,null,0,null,"なし",null,"オート",null,null,"自身",null,"なし",null,"自動",null,null,"5BP",null,0,null,null,"「射程：0-5」「対象：場面(選択)」に変更。1ｾｯｼｮﾝ1回",null,null,null,null,null,null,null,null,null,null,"アースフォース",null,null,null,null,null,null,null,null,"なし",null,"常時",null,null,"自身",null,"なし",null,null,null,null,null,null," ",null,null,{"$f":"\"土ｽｷﾙﾀﾞﾒｰｼﾞ*\"&CE32*3&\" 近遠耐性+\"&CE32*2","v":"土ｽｷﾙﾀﾞﾒｰｼﾞ*0 近遠耐性+0"},null,null,null,null,null,null,null,null,null,null,"ウェザーフォース",null,null,null,null,null,null,null,null,"なし",null,"常時",null,null,"自身",null,"なし",null,null,null,null,null,null,null,null,null,{"$f":"\"「天」適用時ｽｷﾙﾀﾞﾒｰｼﾞ+\"&DP32*3&\"炎水風光耐性+\"&DP32*2","v":"「天」適用時ｽｷﾙﾀﾞﾒｰｼﾞ+0炎水風光耐性+0"}]
[]
[null,"直感ブースト",null,null,null,null,null,null,null,null,"なし",null,"常時",null,null,"自身",null,"なし",null,null,null,null,null,null,null,null,null,{"$f":"\"調査C値-\"&I34+1&\" (下限値：15)\"","v":"調査C値-1 (下限値：15)"},null,null,null,null,null,null,null,null,null,null,"拡散魔法",null,null,null,null,null,null,null,null,"支",null,"サブ",null,null,"自身",null,"なし",null,"自動",null,null,{"$f":"9-AT34&\"MP\"","v":"9MP"},null,1,null,null,{"$f":"\"「種別：魔」の単体ｽｷﾙを、範囲に変更。 +\"&12-AT34&\"MPで0-3場面化。\"","v":"「種別：魔」の単体ｽｷﾙを、範囲に変更。 +12MPで0-3場面化。"},null,null,null,null,null,null,null,null,null,null,"七宝石の導き",null,null,null,null,null,null,null,null,"なし",null,"常時",null,null,"自身",null,"なし",null,null,null,null,null,null,null,null,null,{"$f":"\"「宝」ｽｷﾙ\"&QUOTIENT(CE34,2)&\"種取得可。【物攻】【魔攻】+\"&CE34*2&\" \"&IF(CE34<15,,\"武器指定&判定値無視\")","v":"「宝」ｽｷﾙ0種取得可。【物攻】【魔攻】+0 "},null,null,null,null,null,null,null,null,null,null,"アームズフォース",null,null,null,null,null,null,null,null,"なし",null,"常時",null,null,"自身",null,"なし",null,null,null,null,null,null,null,null,null,{"$f":"\"武器変更中、ｽｷﾙﾀﾞﾒｰｼﾞ+\"&DP34*3&\" 武器変更持続C+\"&IF(CL<QUOTIENT(DP34,2),CL,QUOTIENT(DP34,2))","v":"武器変更中、ｽｷﾙﾀﾞﾒｰｼﾞ+0 武器変更持続C+0"}]
[]
[null,"免許皆伝",null,null,null,null,null,null,null,null,"なし",null,"常時",null,null,"自身",null,"なし",null,null,null,null,null,null,null,null,null,{"$f":"IF(I36<3,\"効果なし\",\"ｸﾗｽｽｷﾙのSL上限+1 & ｸﾗｽｽｷﾙの攻撃によるﾀﾞﾒｰｼﾞ+\"&CL*2)","v":"効果なし"},null,null,null,null,null,null,null,null,null,null,"ガードアシスト",null,null,null,null,null,null,null,null,"防",null,"ダメロ",null,null,"単体",null,"0-1",null,"自動",null,null,"7MP",null,1,null,null,{"$f":"\"対象の被ﾀﾞﾒｰｼﾞを\"&CL&\"D6点軽減。\n1戦闘\"&AT36&\"回\"","v":"対象の被ﾀﾞﾒｰｼﾞを1D6点軽減。\n1戦闘回"},null,null,null,null,null,null,null,null,null,null,"免許皆伝",null,null,null,null,null,null,null,null,"なし",null,"常時",null,null,"自身",null,"なし",null,null,null,null,null,null,null,null,null,{"$f":"IF(CE36<3,\"効果なし\",\"ｸﾗｽｽｷﾙのSL上限+1 & ｸﾗｽｽｷﾙの攻撃によるﾀﾞﾒｰｼﾞ+\"&CL*2)","v":"効果なし"},null,null,null,null,null,null,null,null,null,null,"ヴァイタルフォース",null,null,null,null,null,null,null,null,"なし",null,"常時",null,null,"自身",null,"なし",null,null,null,null,null,null,null,null,null,{"$f":"\"ｻﾌﾞで「回」ｽｷﾙ使用時、与D+\"&DP36*4&\" \"&IF(DP36<20,,\"毒 麻痺 封印無効\")","v":"ｻﾌﾞで「回」ｽｷﾙ使用時、与D+0 "}]
[]
[null,"回避能力",null,null,null,null,null,null,null,null,"なし",null,"常時",null,null,"自身",null,"なし",null,null,null,null,null,null,null,null,null,{"$f":"\"【回避値】\"&CL*2+1&\"以下の場合、【回避値】判定達成値に+\"&I38+1","v":"【回避値】3以下の場合、【回避値】判定達成値に+1"},null,null,null,null,null,null,null,null,null,null,"ワイドスプレッド",null,null,null,null,null,null,null,null,"支",null,"サブ",null,null,"自身",null,"なし",null,"自動",null,null,"2MP",null,2,null,null,{"$f":"\"次ﾒｲﾝのｽｷﾙが近・単体の場合、範囲にする。1戦闘\"&AT38&\"回\"","v":"次ﾒｲﾝのｽｷﾙが近・単体の場合、範囲にする。1戦闘回"},null,null,null,null,null,null,null,null,null,null,"ウォーターフォース",null,null,null,null,null,null,null,null,"なし",null,"常時",null,null,"自身",null,"なし",null,null,null,null,null,null,null,null,null,{"$f":"\"水ｽｷﾙﾀﾞﾒｰｼﾞ+\"&CE38*3&\" 炎氷水耐性+\"&CE38*3","v":"水ｽｷﾙﾀﾞﾒｰｼﾞ+0 炎氷水耐性+0"},null,null,null,null,null,null,null,null,null,null,"気功修練",null,null,null,null,null,null,null,null,"なし",null,"常時",null,null,"自身",null,"なし",null,null,null,null,null,null,null,null,null,{"$f":"\"SFor「0-3」ｽｷﾙﾀﾞﾒｰｼﾞ+\"&DP38*3&\" 炎氷雷耐性+\"&DP38*2&\" \"&IF(DP38<20,,\"石化無効\")","v":"SFor「0-3」ｽｷﾙﾀﾞﾒｰｼﾞ+0 炎氷雷耐性+0 "}]
[]
[null,"抵抗能力",null,null,null,null,null,null,null,null,"なし",null,"常時",null,null,"自身",null,"なし",null,null,null,null,null,null,null,null,null,{"$f":"\"【抵抗値】\"&CL*2+1&\"以下の場合、【抵抗値】判定達成値に+\"&I40+1","v":"【抵抗値】3以下の場合、【抵抗値】判定達成値に+1"},null,null,null,null,null,null,null,null,null,null,"ダブルバレット",null,null,null,null,null,null,null,null,"支",null,"サブ",null,null,"自身",null,"なし",null,"自動",null,null,"12MP",null,2,null,null,{"$f":"\"次ﾒｲﾝのｽｷﾙが射・単体の場合、2体にする。1戦闘\"&AT40&\"回\"","v":"次ﾒｲﾝのｽｷﾙが射・単体の場合、2体にする。1戦闘回"},null,null,null,null,null,null,null,null,null,null,"陰証力波",null,null,null,null,null,null,null,null,"なし",null,"常時",null,null,"自身",null,"なし",null,null,null,null,null,null,null,null,null,{"$f":"\"光闇orYMｽｷﾙﾀﾞﾒｰｼﾞ+\"&CE40&\"D6 闇耐性+\"&CE40&\" SL>陽証SLで 陰陽属性：闇\"","v":"光闇orYMｽｷﾙﾀﾞﾒｰｼﾞ+D6 闇耐性+ SL>陽証SLで 陰陽属性：闇"},null,null,null,null,null,null,null,null,null,null,"ドリームフォース",null,null,null,null,null,null,null,null,"なし",null,"常時",null,null,"自身",null,"なし",null,null,null,null,null,null,null,null,null,{"$f":"\"眠りor催眠付与確定時、ﾀﾞﾒｰｼﾞ+\"&DP40*3&\" \"&IF(DP40<15,,\"眠り 催眠無効\")","v":"眠りor催眠付与確定時、ﾀﾞﾒｰｼﾞ+0 "}]
[]
[null,"クイックブースト",null,null,null,null,null,null,0,null,"なし",null,"常時",null,null,"自身",null,"なし",null,null,null,null,null,null,null,null,null,{"$f":"\"【敏捷】\"&CL+5&\"以下の場合、【敏捷】+\"&I42*3+1","v":"【敏捷】6以下の場合、【敏捷】+1"},null,null,null,null,null,null,null,null,null,null,null,null,null,null,null,null,null,null,null,null,null,null,null,null,null,null,null,null,null,null,null,null,null,null,null,null,null,null,null,null,null,null,null,null,null,null,null,"陽証力波",null,null,null,null,null,null,null,null,"なし",null,"常時",null,null,"自身",null,"なし",null,null,null,null,null,null,null,null,null,{"$f":"\"光闇orYMｽｷﾙﾀﾞﾒｰｼﾞ+\"&CE42&\"D6 光耐性+\"&CE42&\" SL>陽証SLで 陰陽属性：光\"","v":"光闇orYMｽｷﾙﾀﾞﾒｰｼﾞ+D6 光耐性+ SL>陽証SLで 陰陽属性：光"},null,null,null,null,null,null,null,null,null,null,"サイコフォース",null,null,null,null,null,null,null,null,"なし",null,"常時",null,null,"自身",null,"なし",null,null,null,null,null,null,null,null,null,{"$f":"\"ZPor「装備武器」と同属性ｽｷﾙﾀﾞﾒｰｼﾞ+\"&DP42*3&IF(DP42<15,\"\",\"ﾒｲﾝｺｽﾄ-1 命中C値-1 (下限値17)\")","v":"ZPor「装備武器」と同属性ｽｷﾙﾀﾞﾒｰｼﾞ+0"}]
[]
[null,"スピードスタート",null,null,null,null,null,null,0,null,"なし",null,"常時",null,null,"自身",null,"なし",null,null,null,null,null,null,null,null,null,"【敏捷】+2",null,null,null,null,null,null,null,null,null,null,null,null,null,null,null,null,null,null,null,null,null,null,null,null,null,null,null,null,null,null,null,null,null,null,null,null,null,null,null,null,null,null,null,null,null,null,null,"アクセルフォース",null,null,null,null,null,null,null,null,"なし",null,"常時",null,null,"自身",null,"なし",null,null,null,null,null,null,null,null,null,{"$f":"\"ｺｽﾄ10ｽｷﾙﾀﾞﾒｰｼﾞ+\"&CE44*2&\" 【敏捷】+\"&ROUNDUP(CE44/2,0)&\" \"&IF(CE44<10,,\"【回避値】回避C値-1\")","v":"ｺｽﾄ10ｽｷﾙﾀﾞﾒｰｼﾞ+0 【敏捷】+0 "},null,null,null,null,null,null,null,null,null,null,"カラーフォース",null,null,null,null,null,null,null,null,"なし",null,"常時",null,null,"自身",null,"なし",null,null,null,null,null,null,null,null,null,{"$f":"\"〈色属性〉ｽｷﾙ攻撃ﾀﾞﾒｰｼﾞ+\"&DP44*4&\"色属性以外の炎~闇耐性-\"&DP44*3","v":"〈色属性〉ｽｷﾙ攻撃ﾀﾞﾒｰｼﾞ+0色属性以外の炎~闇耐性-0"}]
[]
[null,null,null,null,null,null,null,null,null,null,null,null,null,null,null,null,null,null,null,null,null,null,null,null,null,null,null,null,null,null,null,null,null,null,null,null,null,null,null,null,null,null,null,null,null,null,null,null,null,null,null,null,null,null,null,null,null,null,null,null,null,null,null,null,null,null,null,null,null,null,null,null,null,null,null,"ディセルフォース",null,null,null,null,null,null,null,null,"なし",null,"常時",null,null,"自身",null,"なし",null,null,null,null,null,null,null,null,null,{"$f":"\"ｺｽﾄ10ｽｷﾙﾀﾞﾒｰｼﾞ+\"&CE46*4&\" 【敏捷】-\"&ROUNDUP(CE46/2,0)&\" \"&IF(CE46<10,,\"【抵抗値】回避C値-1\")","v":"ｺｽﾄ10ｽｷﾙﾀﾞﾒｰｼﾞ+0 【敏捷】-0 "},null,null,null,null,null,null,null,null,null,null,"マシンフォース",null,null,null,null,null,null,null,null,"なし",null,"常時",null,null,"自身",null,"なし",null,null,null,null,null,null,null,null,null,{"$f":"\"自身ﾕﾆｯﾄor機械I使用後ﾒｲﾝ攻撃与ﾀﾞﾒｰｼﾞ+\"&DP46&\"D6\"&IF(DP46<15,\"\",\" 機械Iでｻﾌﾞ消費なし\")","v":"自身ﾕﾆｯﾄor機械I使用後ﾒｲﾝ攻撃与ﾀﾞﾒｰｼﾞ+D6"}]
[]
[null,null,null,null,null,null,null,null,null,null,null,null,null,null,null,null,null,null,null,null,null,null,null,null,null,null,null,null,null,null,null,null,null,null,null,null,null,null,null,null,null,null,null,null,null,null,null,null,null,null,null,null,null,null,null,null,null,null,null,null,null,null,null,null,null,null,null,null,null,null,null,null,null,null,null,null,null,null,null,null,null,null,null,null,null,null,null,null,null,null,null,null,null,null,null,null,null,null,null,null,null,null,null,null,null,null,null,null,null,null,null,null,"無敵城塞",null,null,null,null,null,null,null,null,"なし",null,"常時",null,null,"自身",null,"なし",null,null,null,null,null,null,null,null,null,{"$f":"\"[準備期間]が発生した攻撃のﾀﾞﾒｰｼﾞ+\"&DP48*3&\" 常時\"&DP48&\"点軽減 \"&IF(DP48<15,\"\",\"準備中BS無効\")","v":"[準備期間]が発生した攻撃のﾀﾞﾒｰｼﾞ+0 常時点軽減 "}]
[]
[null,null,null,null,null,null,null,null,null,null,null,null,null,null,null,null,null,null,null,null,null,null,null,null,null,null,null,null,null,null,null,null,null,null,null,null,null,null,null,null,null,null,null,null,null,null,null,null,null,null,null,null,null,null,null,null,null,null,null,null,null,null,null,null,null,null,null,null,null,null,null,null,null,null,null,null,null,null,null,null,null,null,null,null,null,null,null,null,null,null,null,null,null,null,null,null,null,null,null,null,null,null,null,null,null,null,null,null,null,null,null,null,"ラッキーフォース",null,null,null,null,null,null,null,null,"なし",null,"常時",null,null,"自身",null,"なし",null,null,null,null,null,null,null,null,null,{"$f":"\"命中判定にｵｰﾄがあった攻撃のﾀﾞﾒｰｼﾞ+\"&DP50*4&IF(DP50<15,\"\",\" 《ｾｶﾝﾄﾞﾁｬﾝｽ》をｺｽﾄ1に変更\")","v":"命中判定にｵｰﾄがあった攻撃のﾀﾞﾒｰｼﾞ+0"}]
[]
[null,null,null,null,null,null,null,null,null,null,null,null,null,null,null,null,null,null,null,null,null,null,null,null,null,null,null,null,null,null,null,null,null,null,null,null,null,null,null,null,null,null,null,null,null,null,null,null,null,null,null,null,null,null,null,null,null,null,null,null,null,null,null,null,null,null,null,null,null,null,null,null,null,null,null,null,null,null,null,null,null,null,null,null,null,null,null,null,null,null,null,null,null,null,null,null,null,null,null,null,null,null,null,null,null,null,null,null,null,null,null,null,"メタルフォース",null,null,null,null,null,null,null,null,"なし",null,"常時",null,null,"自身",null,"なし",null,null,null,null,null,null,null,null,null,{"$f":"\"MWｽｷﾙor本来ｺｽﾄ12以上の攻撃ﾀﾞﾒｰｼﾞ+\"&DP52*3&IF(DP52<10,\"\",\" BP合計値上限+\"&INT(DP52/10))","v":"MWｽｷﾙor本来ｺｽﾄ12以上の攻撃ﾀﾞﾒｰｼﾞ+0"}]

{"sheet":"便利表1","index":2,"n_rows":76,"n_cols":50,"rows_kept":76,"cut":false,"hidden":false,"merged":[[32,22,33,41],[1,3,1,5],[2,3,3,5],[1,6,1,8],[2,6,3,8],[74,26,74,29],[74,30,74,33],[74,34,74,37],[74,38,74,41],[71,26,71,29],[71,30,71,33],[71,34,71,37],[70,38,70,41],[70,26,70,29],[70,30,70,33],[70,34,70,37],[71,38,71,41],[62,26,62,29],[62,30,62,33],[62,34,62,37],[62,38,62,41],[63,26,63,29],[63,30,63,33],[63,34,63,37],[75,26,75,29],[75,30,75,33],[75,34,75,37],[75,38,75,41],[72,26,72,29],[72,30,72,33],[72,34,72,37],[72,38,72,41],[73,26,73,29],[73,30,73,33],[73,34,73,37],[73,38,73,41],[63,38,63,41],[60,26,60,29],[60,30,60,33],[60,34,60,37],[60,38,60,41],[61,26,61,29],[61,30,61,33],[61,34,61,37],[61,38,61,41],[58,26,58,29],[58,30,58,33],[58,34,58,37],[58,38,58,41],[59,26,59,29],[59,30,59,33],[59,34,59,37],[59,38,59,41],[56,26,56,29],[56,30,56,33],[56,34,56,37],[56,38,56,41],[57,26,57,29],[57,30,57,33],[57,34,57,37],[57,38,57,41],[54,26,54,29],[54,30,54,33],[54,34,54,37],[54,38,54,41],[55,26,55,29],[55,30,55,33],[55,34,55,37],[55,38,55,41],[52,26,52,29],[52,30,52,33],[52,34,52,37],[52,38,52,41],[53,26,53,29],[53,30,53,33],[53,34,53,37],[53,38,53,41],[50,26,50,29],[50,30,50,33],[50,34,50,37],[50,38,50,41],[51,26,51,29],[51,30,51,33],[51,34,51,37],[51,38,51,41],[48,26,48,29],[48,30,48,33],[48,34,48,37],[48,38,48,41],[49,26,49,29],[49,30,49,33],[49,34,49,37],[49,38,49,41],[46,26,46,29],[46,30,46,33],[46,34,46,37],[46,38,46,41],[47,26,47,29],[47,30,47,33],[47,34,47,37],[47,38,47,41],[44,26,44,29],[44,30,44,33],[44,34,44,37],[44,38,44,41],[45,26,45,29],[45,30,45,33],[45,34,45,37],[45,38,45,41],[42,26,42,29],[42,30,42,33],[42,34,42,37],[42,38,42,41],[43,26,43,29],[43,30,43,33],[43,34,43,37],[43,38,43,41],[40,26,40,29],[40,30,40,33],[40,34,40,37],[40,38,40,41],[41,26,41,29],[41,30,41,33],[41,34,41,37],[41,38,41,41],[38,26,38,29],[38,30,38,33],[38,34,38,37],[38,38,38,41],[39,26,39,29],[39,30,39,33],[39,34,39,37],[39,38,39,41],[36,26,36,29],[36,30,36,33],[36,34,36,37],[36,38,36,41],[37,26,37,29],[37,30,37,33],[37,34,37,37],[37,38,37,41],[34,26,34,29],[34,30,34,33],[34,34,34,37],[34,38,34,41],[35,26,35,29],[35,30,35,33],[35,34,35,37],[35,38,35,41],[71,22,71,25],[70,22,70,25],[52,22,52,25],[53,22,53,25],[54,22,54,25],[55,22,55,25],[56,22,56,25],[57,22,57,25],[46,22,46,25],[47,22,47,25],[48,22,48,25],[49,22,49,25],[50,22,50,25],[51,22,51,25],[40,22,40,25],[41,22,41,25],[72,22,72,25],[73,22,73,25],[74,22,74,25],[75,22,75,25],[58,22,58,25],[59,22,59,25],[60,22,60,25],[61,22,61,25],[62,22,62,25],[63,22,63,25],[42,22,42,25],[43,22,43,25],[44,22,44,25],[45,22,45,25],[75,12,75,21],[32,12,32,21],[32,2,32,11],[34,22,34,25],[35,22,35,25],[36,22,36,25],[37,22,37,25],[38,22,38,25],[39,22,39,25],[63,12,63,21],[70,12,70,21],[71,12,71,21],[72,12,72,21],[73,12,73,21],[74,12,74,21],[57,12,57,21],[58,12,58,21],[59,12,59,21],[60,12,60,21],[61,12,61,21],[62,12,62,21],[51,12,51,21],[52,12,52,21],[53,12,53,21],[54,12,54,21],[55,12,55,21],[56,12,56,21],[45,12,45,21],[46,12,46,21],[47,12,47,21],[48,12,48,21],[49,12,49,21],[50,12,50,21],[39,12,39,21],[40,12,40,21],[41,12,41,21],[42,12,42,21],[43,12,43,21],[44,12,44,21],[33,12,33,21],[34,12,34,21],[35,12,35,21],[36,12,36,21],[37,12,37,21],[38,12,38,21],[30,7,30,17],[30,38,30,40],[30,49,30,60],[5,18,5,37],[5,2,5,6],[5,7,5,17],[5,38,5,60],[28,7,28,17],[28,38,28,40],[28,49,28,60],[29,7,29,17],[29,38,29,40],[29,49,29,60],[26,7,26,17],[26,38,26,40],[26,49,26,60],[27,7,27,17],[27,38,27,40],[27,49,27,60],[24,7,24,17],[24,38,24,40],[24,49,24,60],[25,7,25,17],[25,38,25,40],[25,49,25,60],[22,7,22,17],[22,38,22,40],[22,49,22,60],[23,7,23,17],[23,38,23,40],[23,49,23,60],[20,7,20,17],[20,38,20,40],[20,49,20,60],[21,7,21,17],[21,38,21,40],[21,49,21,60],[18,7,18,17],[18,38,18,40],[18,49,18,60],[19,7,19,17],[19,38,19,40],[19,49,19,60],[16,7,16,17],[16,38,16,40],[16,49,16,60],[17,7,17,17],[17,38,17,40],[17,49,17,60],[14,7,14,17],[14,38,14,40],[14,49,14,60],[15,7,15,17],[15,38,15,40],[15,49,15,60],[12,7,12,17],[12,38,12,40],[12,49,12,60],[13,7,13,17],[13,38,13,40],[13,49,13,60],[11,7,11,17],[11,38,11,40],[11,49,11,60],[8,7,8,17],[8,38,8,40],[8,49,8,60],[9,7,9,17],[9,38,9,40],[9,49,9,60],[6,7,6,17],[6,38,6,40],[6,49,6,60],[7,7,7,17],[7,38,7,40],[7,49,7,60],[10,7,10,17],[10,38,10,40],[10,49,10,60],[64,12,64,21],[64,22,64,25],[64,26,64,29],[64,30,64,33],[64,34,64,37],[64,38,64,41],[65,12,65,21],[65,22,65,25],[65,26,65,29],[65,30,65,33],[65,34,65,37],[65,38,65,41],[66,12,66,21],[66,22,66,25],[66,26,66,29],[66,30,66,33],[66,34,66,37],[66,38,66,41],[67,12,67,21],[67,22,67,25],[67,26,67,29],[67,30,67,33],[67,34,67,37],[67,38,67,41],[68,12,68,21],[68,22,68,25],[68,26,68,29],[68,30,68,33],[68,34,68,37],[68,38,68,41],[69,12,69,21],[69,22,69,25],[69,26,69,29],[69,30,69,33],[69,34,69,37],[69,38,69,41]]}
[]
[null,null,null,"命中基準値",null,null,"敏捷上限値"]
[null,null,null,{"$f":"IF(CL<8,CL*2+8,CL+16)","v":10},null,null,{"$f":"CL*2+15","v":17}]
[]
[]
[null,"●種族",{"$f":"\"↓CL\"&CL&\"のときの能力値↓\"","v":"↓CL1のときの能力値↓"},null,null,null,null,"↓CL反映済み↓",null,null,null,null,null,null,null,null,null,null,{"$f":"\"↓CLが\"&CL&\"のときのデータ↓ そのCLで最高値→赤字 最小値→青字\"","v":"↓CLが1のときのデータ↓ そのCLで最高値→赤字 最小値→青字"},null,null,null,null,null,null,null,null,null,null,null,null,null,null,null,null,null,null,null,"自動取得スキル"]
[null,"種族名","肉体","集中","反射","知識","幸運","種族特典 (CLが反映されている)",null,null,null,null,null,null,null,null,null,null,"近接","射撃","回避","魔術","抵抗","敏捷","物攻","魔攻","耐久","精神","近","遠","炎","氷","水","雷","風","土","光","闇","名称",null,null,"SL","種別","ﾀｲﾐﾝｸﾞ","対象","射程","判定値","代償","コスト","自動取得"]
[null,"人間",{"$f":"VL用!B2+CL","v":7},{"$f":"VL用!C2+CL","v":13},{"$f":"VL用!D2+CL","v":8},{"$f":"VL用!E2+CL","v":9},{"$f":"VL用!F2+CL","v":9},"常時C値-1(下限値16) & 集中判定を1度振り直せる。",null,null,null,null,null,null,null,null,null,null,{"$f":"IF(CL=1,VL用!G28,IF(CL=2,VL用!AB28,IF(CL=3,VL用!AW28,IF(CL=4,VL用!BR28,IF(CL=5,VL用!CM28,IF(CL=6,VL用!DH28,IF(CL=7,VL用!EC28,IF(CL=8,VL用!EX28,IF(CL=9,VL用!FS28,VL用!GN28)))))))))","v":5},{"$f":"IF(CL=1,VL用!H28,IF(CL=2,VL用!AC28,IF(CL=3,VL用!AX28,IF(CL=4,VL用!BS28,IF(CL=5,VL用!CN28,IF(CL=6,VL用!DI28,IF(CL=7,VL用!ED28,IF(CL=8,VL用!EY28,IF(CL=9,VL用!FT28,VL用!GO28)))))))))","v":5},{"$f":"IF(CL=1,VL用!I28,IF(CL=2,VL用!AD28,IF(CL=3,VL用!AY28,IF(CL=4,VL用!BT28,IF(CL=5,VL用!CO28,IF(CL=6,VL用!DJ28,IF(CL=7,VL用!EE28,IF(CL=8,VL用!EZ28,IF(CL=9,VL用!FU28,VL用!GP28)))))))))","v":3},{"$f":"IF(CL=1,VL用!J28,IF(CL=2,VL用!AE28,IF(CL=3,VL用!AZ28,IF(CL=4,VL用!BU28,IF(CL=5,VL用!CP28,IF(CL=6,VL用!DK28,IF(CL=7,VL用!EF28,IF(CL=8,VL用!FA28,IF(CL=9,VL用!FV28,VL用!GQ28)))))))))","v":4},{"$f":"IF(CL=1,VL用!K28,IF(CL=2,VL用!AF28,IF(CL=3,VL用!BA28,IF(CL=4,VL用!BV28,IF(CL=5,VL用!CQ28,IF(CL=6,VL用!DL28,IF(CL=7,VL用!EG28,IF(CL=8,VL用!FB28,IF(CL=9,VL用!FW28,VL用!GR28)))))))))","v":3},{"$f":"IF(CL=1,VL用!L28,IF(CL=2,VL用!AG28,IF(CL=3,VL用!BB28,IF(CL=4,VL用!BW28,IF(CL=5,VL用!CR28,IF(CL=6,VL用!DM28,IF(CL=7,VL用!EH28,IF(CL=8,VL用!FC28,IF(CL=9,VL用!FX28,VL用!GS28)))))))))","v":4},{"$f":"IF(CL=1,VL用!M28,IF(CL=2,VL用!AH28,IF(CL=3,VL用!BC28,IF(CL=4,VL用!BX28,IF(CL=5,VL用!CS28,IF(CL=6,VL用!DN28,IF(CL=7,VL用!EI28,IF(CL=8,VL用!FD28,IF(CL=9,VL用!FY28,VL用!GT28)))))))))","v":10},{"$f":"IF(CL=1,VL用!N28,IF(CL=2,VL用!AI28,IF(CL=3,VL用!BD28,IF(CL=4,VL用!BY28,IF(CL=5,VL用!CT28,IF(CL=6,VL用!DO28,IF(CL=7,VL用!EJ28,IF(CL=8,VL用!FE28,IF(CL=9,VL用!FZ28,VL用!GU28)))))))))","v":10},{"$f":"IF(CL=1,VL用!O28,IF(CL=2,VL用!AJ28,IF(CL=3,VL用!BE28,IF(CL=4,VL用!BZ28,IF(CL=5,VL用!CU28,IF(CL=6,VL用!DP28,IF(CL=7,VL用!EK28,IF(CL=8,VL用!FF28,IF(CL=9,VL用!GA28,VL用!GV28)))))))))","v":100},{"$f":"IF(CL=1,VL用!P28,IF(CL=2,VL用!AK28,IF(CL=3,VL用!BF28,IF(CL=4,VL用!CA28,IF(CL=5,VL用!CV28,IF(CL=6,VL用!DQ28,IF(CL=7,VL用!EL28,IF(CL=8,VL用!FG28,IF(CL=9,VL用!GB28,VL用!GW28)))))))))","v":30},{"$f":"IF(CL=1,VL用!Q28,IF(CL=2,VL用!AL28,IF(CL=3,VL用!BG28,IF(CL=4,VL用!CB28,IF(CL=5,VL用!CW28,IF(CL=6,VL用!DR28,IF(CL=7,VL用!EM28,IF(CL=8,VL用!FH28,IF(CL=9,VL用!GC28,VL用!GX28)))))))))","v":10},{"$f":"IF(CL=1,VL用!R28,IF(CL=2,VL用!AM28,IF(CL=3,VL用!BH28,IF(CL=4,VL用!CC28,IF(CL=5,VL用!CX28,IF(CL=6,VL用!DS28,IF(CL=7,VL用!EN28,IF(CL=8,VL用!FI28,IF(CL=9,VL用!GD28,VL用!GY28)))))))))","v":10},{"$f":"IF(CL=1,VL用!S28,IF(CL=2,VL用!AN28,IF(CL=3,VL用!BI28,IF(CL=4,VL用!CD28,IF(CL=5,VL用!CY28,IF(CL=6,VL用!DT28,IF(CL=7,VL用!EO28,IF(CL=8,VL用!FJ28,IF(CL=9,VL用!GE28,VL用!GZ28)))))))))","v":0},{"$f":"IF(CL=1,VL用!T28,IF(CL=2,VL用!AO28,IF(CL=3,VL用!BJ28,IF(CL=4,VL用!CE28,IF(CL=5,VL用!CZ28,IF(CL=6,VL用!DU28,IF(CL=7,VL用!EP28,IF(CL=8,VL用!FK28,IF(CL=9,VL用!GF28,VL用!HA28)))))))))","v":0},{"$f":"IF(CL=1,VL用!U28,IF(CL=2,VL用!AP28,IF(CL=3,VL用!BK28,IF(CL=4,VL用!CF28,IF(CL=5,VL用!DA28,IF(CL=6,VL用!DV28,IF(CL=7,VL用!EQ28,IF(CL=8,VL用!FL28,IF(CL=9,VL用!GG28,VL用!HB28)))))))))","v":-5},{"$f":"IF(CL=1,VL用!V28,IF(CL=2,VL用!AQ28,IF(CL=3,VL用!BL28,IF(CL=4,VL用!CG28,IF(CL=5,VL用!DB28,IF(CL=6,VL用!DW28,IF(CL=7,VL用!ER28,IF(CL=8,VL用!FM28,IF(CL=9,VL用!GH28,VL用!HC28)))))))))","v":0},{"$f":"IF(CL=1,VL用!W28,IF(CL=2,VL用!AR28,IF(CL=3,VL用!BM28,IF(CL=4,VL用!CH28,IF(CL=5,VL用!DC28,IF(CL=6,VL用!DX28,IF(CL=7,VL用!ES28,IF(CL=8,VL用!FN28,IF(CL=9,VL用!GI28,VL用!HD28)))))))))","v":5},{"$f":"IF(CL=1,VL用!X28,IF(CL=2,VL用!AS28,IF(CL=3,VL用!BN28,IF(CL=4,VL用!CI28,IF(CL=5,VL用!DD28,IF(CL=6,VL用!DY28,IF(CL=7,VL用!ET28,IF(CL=8,VL用!FO28,IF(CL=9,VL用!GJ28,VL用!HE28)))))))))","v":2},{"$f":"IF(CL=1,VL用!Y28,IF(CL=2,VL用!AT28,IF(CL=3,VL用!BO28,IF(CL=4,VL用!CJ28,IF(CL=5,VL用!DE28,IF(CL=6,VL用!DZ28,IF(CL=7,VL用!EU28,IF(CL=8,VL用!FP28,IF(CL=9,VL用!GK28,VL用!HF28)))))))))","v":4},{"$f":"IF(CL=1,VL用!Z28,IF(CL=2,VL用!AU28,IF(CL=3,VL用!BP28,IF(CL=4,VL用!CK28,IF(CL=5,VL用!DF28,IF(CL=6,VL用!EA28,IF(CL=7,VL用!EV28,IF(CL=8,VL用!FQ28,IF(CL=9,VL用!GL28,VL用!HG28)))))))))","v":3},"起死回生",null,null,"★","自","ｵｰﾄ","自","なし","自動","6BP",0,"判定直後ダイス目を両方9にする。対抗判定のC値が20固定。戦闘外では-2BP。"]
[null,"天使",{"$f":"VL用!B3+CL","v":7},{"$f":"VL用!C3+CL","v":9},{"$f":"VL用!D3+CL","v":8},{"$f":"VL用!E3+CL","v":12},{"$f":"VL用!F3+CL","v":9},{"$f":"\"封印,不動無効。ｸﾘﾃｨｶﾙでMPを\"&(5+CS!T12*2)&\"点回復。\"","v":"封印,不動無効。ｸﾘﾃｨｶﾙでMPを5点回復。"},null,null,null,null,null,null,null,null,null,null,{"$f":"IF(CL=1,VL用!G29,IF(CL=2,VL用!AB29,IF(CL=3,VL用!AW29,IF(CL=4,VL用!BR29,IF(CL=5,VL用!CM29,IF(CL=6,VL用!DH29,IF(CL=7,VL用!EC29,IF(CL=8,VL用!EX29,IF(CL=9,VL用!FS29,VL用!GN29)))))))))","v":3},{"$f":"IF(CL=1,VL用!H29,IF(CL=2,VL用!AC29,IF(CL=3,VL用!AX29,IF(CL=4,VL用!BS29,IF(CL=5,VL用!CN29,IF(CL=6,VL用!DI29,IF(CL=7,VL用!ED29,IF(CL=8,VL用!EY29,IF(CL=9,VL用!FT29,VL用!GO29)))))))))","v":4},{"$f":"IF(CL=1,VL用!I29,IF(CL=2,VL用!AD29,IF(CL=3,VL用!AY29,IF(CL=4,VL用!BT29,IF(CL=5,VL用!CO29,IF(CL=6,VL用!DJ29,IF(CL=7,VL用!EE29,IF(CL=8,VL用!EZ29,IF(CL=9,VL用!FU29,VL用!GP29)))))))))","v":3},{"$f":"IF(CL=1,VL用!J29,IF(CL=2,VL用!AE29,IF(CL=3,VL用!AZ29,IF(CL=4,VL用!BU29,IF(CL=5,VL用!CP29,IF(CL=6,VL用!DK29,IF(CL=7,VL用!EF29,IF(CL=8,VL用!FA29,IF(CL=9,VL用!FV29,VL用!GQ29)))))))))","v":5},{"$f":"IF(CL=1,VL用!K29,IF(CL=2,VL用!AF29,IF(CL=3,VL用!BA29,IF(CL=4,VL用!BV29,IF(CL=5,VL用!CQ29,IF(CL=6,VL用!DL29,IF(CL=7,VL用!EG29,IF(CL=8,VL用!FB29,IF(CL=9,VL用!FW29,VL用!GR29)))))))))","v":3},{"$f":"IF(CL=1,VL用!L29,IF(CL=2,VL用!AG29,IF(CL=3,VL用!BB29,IF(CL=4,VL用!BW29,IF(CL=5,VL用!CR29,IF(CL=6,VL用!DM29,IF(CL=7,VL用!EH29,IF(CL=8,VL用!FC29,IF(CL=9,VL用!FX29,VL用!GS29)))))))))","v":3},{"$f":"IF(CL=1,VL用!M29,IF(CL=2,VL用!AH29,IF(CL=3,VL用!BC29,IF(CL=4,VL用!BX29,IF(CL=5,VL用!CS29,IF(CL=6,VL用!DN29,IF(CL=7,VL用!EI29,IF(CL=8,VL用!FD29,IF(CL=9,VL用!FY29,VL用!GT29)))))))))","v":10},{"$f":"IF(CL=1,VL用!N29,IF(CL=2,VL用!AI29,IF(CL=3,VL用!BD29,IF(CL=4,VL用!BY29,IF(CL=5,VL用!CT29,IF(CL=6,VL用!DO29,IF(CL=7,VL用!EJ29,IF(CL=8,VL用!FE29,IF(CL=9,VL用!FZ29,VL用!GU29)))))))))","v":13},{"$f":"IF(CL=1,VL用!O29,IF(CL=2,VL用!AJ29,IF(CL=3,VL用!BE29,IF(CL=4,VL用!BZ29,IF(CL=5,VL用!CU29,IF(CL=6,VL用!DP29,IF(CL=7,VL用!EK29,IF(CL=8,VL用!FF29,IF(CL=9,VL用!GA29,VL用!GV29)))))))))","v":88},{"$f":"IF(CL=1,VL用!P29,IF(CL=2,VL用!AK29,IF(CL=3,VL用!BF29,IF(CL=4,VL用!CA29,IF(CL=5,VL用!CV29,IF(CL=6,VL用!DQ29,IF(CL=7,VL用!EL29,IF(CL=8,VL用!FG29,IF(CL=9,VL用!GB29,VL用!GW29)))))))))","v":35},{"$f":"IF(CL=1,VL用!Q29,IF(CL=2,VL用!AL29,IF(CL=3,VL用!BG29,IF(CL=4,VL用!CB29,IF(CL=5,VL用!CW29,IF(CL=6,VL用!DR29,IF(CL=7,VL用!EM29,IF(CL=8,VL用!FH29,IF(CL=9,VL用!GC29,VL用!GX29)))))))))","v":8},{"$f":"IF(CL=1,VL用!R29,IF(CL=2,VL用!AM29,IF(CL=3,VL用!BH29,IF(CL=4,VL用!CC29,IF(CL=5,VL用!CX29,IF(CL=6,VL用!DS29,IF(CL=7,VL用!EN29,IF(CL=8,VL用!FI29,IF(CL=9,VL用!GD29,VL用!GY29)))))))))","v":11},{"$f":"IF(CL=1,VL用!S29,IF(CL=2,VL用!AN29,IF(CL=3,VL用!BI29,IF(CL=4,VL用!CD29,IF(CL=5,VL用!CY29,IF(CL=6,VL用!DT29,IF(CL=7,VL用!EO29,IF(CL=8,VL用!FJ29,IF(CL=9,VL用!GE29,VL用!GZ29)))))))))","v":3},{"$f":"IF(CL=1,VL用!T29,IF(CL=2,VL用!AO29,IF(CL=3,VL用!BJ29,IF(CL=4,VL用!CE29,IF(CL=5,VL用!CZ29,IF(CL=6,VL用!DU29,IF(CL=7,VL用!EP29,IF(CL=8,VL用!FK29,IF(CL=9,VL用!GF29,VL用!HA29)))))))))","v":3},{"$f":"IF(CL=1,VL用!U29,IF(CL=2,VL用!AP29,IF(CL=3,VL用!BK29,IF(CL=4,VL用!CF29,IF(CL=5,VL用!DA29,IF(CL=6,VL用!DV29,IF(CL=7,VL用!EQ29,IF(CL=8,VL用!FL29,IF(CL=9,VL用!GG29,VL用!HB29)))))))))","v":3},{"$f":"IF(CL=1,VL用!V29,IF(CL=2,VL用!AQ29,IF(CL=3,VL用!BL29,IF(CL=4,VL用!CG29,IF(CL=5,VL用!DB29,IF(CL=6,VL用!DW29,IF(CL=7,VL用!ER29,IF(CL=8,VL用!FM29,IF(CL=9,VL用!GH29,VL用!HC29)))))))))","v":0},{"$f":"IF(CL=1,VL用!W29,IF(CL=2,VL用!AR29,IF(CL=3,VL用!BM29,IF(CL=4,VL用!CH29,IF(CL=5,VL用!DC29,IF(CL=6,VL用!DX29,IF(CL=7,VL用!ES29,IF(CL=8,VL用!FN29,IF(CL=9,VL用!GI29,VL用!HD29)))))))))","v":-10},{"$f":"IF(CL=1,VL用!X29,IF(CL=2,VL用!AS29,IF(CL=3,VL用!BN29,IF(CL=4,VL用!CI29,IF(CL=5,VL用!DD29,IF(CL=6,VL用!DY29,IF(CL=7,VL用!ET29,IF(CL=8,VL用!FO29,IF(CL=9,VL用!GJ29,VL用!HE29)))))))))","v":10},{"$f":"IF(CL=1,VL用!Y29,IF(CL=2,VL用!AT29,IF(CL=3,VL用!BO29,IF(CL=4,VL用!CJ29,IF(CL=5,VL用!DE29,IF(CL=6,VL用!DZ29,IF(CL=7,VL用!EU29,IF(CL=8,VL用!FP29,IF(CL=9,VL用!GK29,VL用!HF29)))))))))","v":14},{"$f":"IF(CL=1,VL用!Z29,IF(CL=2,VL用!AU29,IF(CL=3,VL用!BP29,IF(CL=4,VL用!CK29,IF(CL=5,VL用!DF29,IF(CL=6,VL用!EA29,IF(CL=7,VL用!EV29,IF(CL=8,VL用!FQ29,IF(CL=9,VL用!GL29,VL用!HG29)))))))))","v":-20},"祝福",null,null,"★","自","ｵｰﾄ","[単]","0-5","自動","2BP",0,"ｶｳﾝﾄ開始時に使用。対象のスキル使用回数を1回回復する。"]
[null,"悪魔",{"$f":"VL用!B4+CL","v":11},{"$f":"VL用!C4+CL","v":7},{"$f":"VL用!D4+CL","v":8},{"$f":"VL用!E4+CL","v":12},{"$f":"VL用!F4+CL","v":7},"種別：魔のスキルのバステ無効 & 通常攻撃のコスト-1",null,null,null,null,null,null,null,null,null,null,{"$f":"IF(CL=1,VL用!G30,IF(CL=2,VL用!AB30,IF(CL=3,VL用!AW30,IF(CL=4,VL用!BR30,IF(CL=5,VL用!CM30,IF(CL=6,VL用!DH30,IF(CL=7,VL用!EC30,IF(CL=8,VL用!EX30,IF(CL=9,VL用!FS30,VL用!GN30)))))))))","v":4},{"$f":"IF(CL=1,VL用!H30,IF(CL=2,VL用!AC30,IF(CL=3,VL用!AX30,IF(CL=4,VL用!BS30,IF(CL=5,VL用!CN30,IF(CL=6,VL用!DI30,IF(CL=7,VL用!ED30,IF(CL=8,VL用!EY30,IF(CL=9,VL用!FT30,VL用!GO30)))))))))","v":3},{"$f":"IF(CL=1,VL用!I30,IF(CL=2,VL用!AD30,IF(CL=3,VL用!AY30,IF(CL=4,VL用!BT30,IF(CL=5,VL用!CO30,IF(CL=6,VL用!DJ30,IF(CL=7,VL用!EE30,IF(CL=8,VL用!EZ30,IF(CL=9,VL用!FU30,VL用!GP30)))))))))","v":3},{"$f":"IF(CL=1,VL用!J30,IF(CL=2,VL用!AE30,IF(CL=3,VL用!AZ30,IF(CL=4,VL用!BU30,IF(CL=5,VL用!CP30,IF(CL=6,VL用!DK30,IF(CL=7,VL用!EF30,IF(CL=8,VL用!FA30,IF(CL=9,VL用!FV30,VL用!GQ30)))))))))","v":4},{"$f":"IF(CL=1,VL用!K30,IF(CL=2,VL用!AF30,IF(CL=3,VL用!BA30,IF(CL=4,VL用!BV30,IF(CL=5,VL用!CQ30,IF(CL=6,VL用!DL30,IF(CL=7,VL用!EG30,IF(CL=8,VL用!FB30,IF(CL=9,VL用!FW30,VL用!GR30)))))))))","v":4},{"$f":"IF(CL=1,VL用!L30,IF(CL=2,VL用!AG30,IF(CL=3,VL用!BB30,IF(CL=4,VL用!BW30,IF(CL=5,VL用!CR30,IF(CL=6,VL用!DM30,IF(CL=7,VL用!EH30,IF(CL=8,VL用!FC30,IF(CL=9,VL用!FX30,VL用!GS30)))))))))","v":1},{"$f":"IF(CL=1,VL用!M30,IF(CL=2,VL用!AH30,IF(CL=3,VL用!BC30,IF(CL=4,VL用!BX30,IF(CL=5,VL用!CS30,IF(CL=6,VL用!DN30,IF(CL=7,VL用!EI30,IF(CL=8,VL用!FD30,IF(CL=9,VL用!FY30,VL用!GT30)))))))))","v":13},{"$f":"IF(CL=1,VL用!N30,IF(CL=2,VL用!AI30,IF(CL=3,VL用!BD30,IF(CL=4,VL用!BY30,IF(CL=5,VL用!CT30,IF(CL=6,VL用!DO30,IF(CL=7,VL用!EJ30,IF(CL=8,VL用!FE30,IF(CL=9,VL用!FZ30,VL用!GU30)))))))))","v":8},{"$f":"IF(CL=1,VL用!O30,IF(CL=2,VL用!AJ30,IF(CL=3,VL用!BE30,IF(CL=4,VL用!BZ30,IF(CL=5,VL用!CU30,IF(CL=6,VL用!DP30,IF(CL=7,VL用!EK30,IF(CL=8,VL用!FF30,IF(CL=9,VL用!GA30,VL用!GV30)))))))))","v":115},{"$f":"IF(CL=1,VL用!P30,IF(CL=2,VL用!AK30,IF(CL=3,VL用!BF30,IF(CL=4,VL用!CA30,IF(CL=5,VL用!CV30,IF(CL=6,VL用!DQ30,IF(CL=7,VL用!EL30,IF(CL=8,VL用!FG30,IF(CL=9,VL用!GB30,VL用!GW30)))))))))","v":28},{"$f":"IF(CL=1,VL用!Q30,IF(CL=2,VL用!AL30,IF(CL=3,VL用!BG30,IF(CL=4,VL用!CB30,IF(CL=5,VL用!CW30,IF(CL=6,VL用!DR30,IF(CL=7,VL用!EM30,IF(CL=8,VL用!FH30,IF(CL=9,VL用!GC30,VL用!GX30)))))))))","v":10},{"$f":"IF(CL=1,VL用!R30,IF(CL=2,VL用!AM30,IF(CL=3,VL用!BH30,IF(CL=4,VL用!CC30,IF(CL=5,VL用!CX30,IF(CL=6,VL用!DS30,IF(CL=7,VL用!EN30,IF(CL=8,VL用!FI30,IF(CL=9,VL用!GD30,VL用!GY30)))))))))","v":8},{"$f":"IF(CL=1,VL用!S30,IF(CL=2,VL用!AN30,IF(CL=3,VL用!BI30,IF(CL=4,VL用!CD30,IF(CL=5,VL用!CY30,IF(CL=6,VL用!DT30,IF(CL=7,VL用!EO30,IF(CL=8,VL用!FJ30,IF(CL=9,VL用!GE30,VL用!GZ30)))))))))","v":4},{"$f":"IF(CL=1,VL用!T30,IF(CL=2,VL用!AO30,IF(CL=3,VL用!BJ30,IF(CL=4,VL用!CE30,IF(CL=5,VL用!CZ30,IF(CL=6,VL用!DU30,IF(CL=7,VL用!EP30,IF(CL=8,VL用!FK30,IF(CL=9,VL用!GF30,VL用!HA30)))))))))","v":4},{"$f":"IF(CL=1,VL用!U30,IF(CL=2,VL用!AP30,IF(CL=3,VL用!BK30,IF(CL=4,VL用!CF30,IF(CL=5,VL用!DA30,IF(CL=6,VL用!DV30,IF(CL=7,VL用!EQ30,IF(CL=8,VL用!FL30,IF(CL=9,VL用!GG30,VL用!HB30)))))))))","v":1},{"$f":"IF(CL=1,VL用!V30,IF(CL=2,VL用!AQ30,IF(CL=3,VL用!BL30,IF(CL=4,VL用!CG30,IF(CL=5,VL用!DB30,IF(CL=6,VL用!DW30,IF(CL=7,VL用!ER30,IF(CL=8,VL用!FM30,IF(CL=9,VL用!GH30,VL用!HC30)))))))))","v":0},{"$f":"IF(CL=1,VL用!W30,IF(CL=2,VL用!AR30,IF(CL=3,VL用!BM30,IF(CL=4,VL用!CH30,IF(CL=5,VL用!DC30,IF(CL=6,VL用!DX30,IF(CL=7,VL用!ES30,IF(CL=8,VL用!FN30,IF(CL=9,VL用!GI30,VL用!HD30)))))))))","v":-2},{"$f":"IF(CL=1,VL用!X30,IF(CL=2,VL用!AS30,IF(CL=3,VL用!BN30,IF(CL=4,VL用!CI30,IF(CL=5,VL用!DD30,IF(CL=6,VL用!DY30,IF(CL=7,VL用!ET30,IF(CL=8,VL用!FO30,IF(CL=9,VL用!GJ30,VL用!HE30)))))))))","v":3},{"$f":"IF(CL=1,VL用!Y30,IF(CL=2,VL用!AT30,IF(CL=3,VL用!BO30,IF(CL=4,VL用!CJ30,IF(CL=5,VL用!DE30,IF(CL=6,VL用!DZ30,IF(CL=7,VL用!EU30,IF(CL=8,VL用!FP30,IF(CL=9,VL用!GK30,VL用!HF30)))))))))","v":-10},{"$f":"IF(CL=1,VL用!Z30,IF(CL=2,VL用!AU30,IF(CL=3,VL用!BP30,IF(CL=4,VL用!CK30,IF(CL=5,VL用!DF30,IF(CL=6,VL用!EA30,IF(CL=7,VL用!EV30,IF(CL=8,VL用!FQ30,IF(CL=9,VL用!GL30,VL用!HG30)))))))))","v":10},"増幅する苦痛",null,null,"★","自","ｵｰﾄ","単","0-4","自動","7BP",5,"敵(対象)が受けたダメージの半分(↓)を他の敵全てに与える。"]
[null,"妖精",{"$f":"VL用!B5+CL","v":8},{"$f":"VL用!C5+CL","v":10},{"$f":"VL用!D5+CL","v":7},{"$f":"VL用!E5+CL","v":9},{"$f":"VL用!F5+CL","v":11},"サブアクションで、サブアクションのスキルを2つ使用できる。",null,null,null,null,null,null,null,null,null,null,{"$f":"IF(CL=1,VL用!G31,IF(CL=2,VL用!AB31,IF(CL=3,VL用!AW31,IF(CL=4,VL用!BR31,IF(CL=5,VL用!CM31,IF(CL=6,VL用!DH31,IF(CL=7,VL用!EC31,IF(CL=8,VL用!EX31,IF(CL=9,VL用!FS31,VL用!GN31)))))))))","v":4},{"$f":"IF(CL=1,VL用!H31,IF(CL=2,VL用!AC31,IF(CL=3,VL用!AX31,IF(CL=4,VL用!BS31,IF(CL=5,VL用!CN31,IF(CL=6,VL用!DI31,IF(CL=7,VL用!ED31,IF(CL=8,VL用!EY31,IF(CL=9,VL用!FT31,VL用!GO31)))))))))","v":5},{"$f":"IF(CL=1,VL用!I31,IF(CL=2,VL用!AD31,IF(CL=3,VL用!AY31,IF(CL=4,VL用!BT31,IF(CL=5,VL用!CO31,IF(CL=6,VL用!DJ31,IF(CL=7,VL用!EE31,IF(CL=8,VL用!EZ31,IF(CL=9,VL用!FU31,VL用!GP31)))))))))","v":3},{"$f":"IF(CL=1,VL用!J31,IF(CL=2,VL用!AE31,IF(CL=3,VL用!AZ31,IF(CL=4,VL用!BU31,IF(CL=5,VL用!CP31,IF(CL=6,VL用!DK31,IF(CL=7,VL用!EF31,IF(CL=8,VL用!FA31,IF(CL=9,VL用!FV31,VL用!GQ31)))))))))","v":4},{"$f":"IF(CL=1,VL用!K31,IF(CL=2,VL用!AF31,IF(CL=3,VL用!BA31,IF(CL=4,VL用!BV31,IF(CL=5,VL用!CQ31,IF(CL=6,VL用!DL31,IF(CL=7,VL用!EG31,IF(CL=8,VL用!FB31,IF(CL=9,VL用!FW31,VL用!GR31)))))))))","v":4},{"$f":"IF(CL=1,VL用!L31,IF(CL=2,VL用!AG31,IF(CL=3,VL用!BB31,IF(CL=4,VL用!BW31,IF(CL=5,VL用!CR31,IF(CL=6,VL用!DM31,IF(CL=7,VL用!EH31,IF(CL=8,VL用!FC31,IF(CL=9,VL用!FX31,VL用!GS31)))))))))","v":5},{"$f":"IF(CL=1,VL用!M31,IF(CL=2,VL用!AH31,IF(CL=3,VL用!BC31,IF(CL=4,VL用!BX31,IF(CL=5,VL用!CS31,IF(CL=6,VL用!DN31,IF(CL=7,VL用!EI31,IF(CL=8,VL用!FD31,IF(CL=9,VL用!FY31,VL用!GT31)))))))))","v":9},{"$f":"IF(CL=1,VL用!N31,IF(CL=2,VL用!AI31,IF(CL=3,VL用!BD31,IF(CL=4,VL用!BY31,IF(CL=5,VL用!CT31,IF(CL=6,VL用!DO31,IF(CL=7,VL用!EJ31,IF(CL=8,VL用!FE31,IF(CL=9,VL用!FZ31,VL用!GU31)))))))))","v":10},{"$f":"IF(CL=1,VL用!O31,IF(CL=2,VL用!AJ31,IF(CL=3,VL用!BE31,IF(CL=4,VL用!BZ31,IF(CL=5,VL用!CU31,IF(CL=6,VL用!DP31,IF(CL=7,VL用!EK31,IF(CL=8,VL用!FF31,IF(CL=9,VL用!GA31,VL用!GV31)))))))))","v":85},{"$f":"IF(CL=1,VL用!P31,IF(CL=2,VL用!AK31,IF(CL=3,VL用!BF31,IF(CL=4,VL用!CA31,IF(CL=5,VL用!CV31,IF(CL=6,VL用!DQ31,IF(CL=7,VL用!EL31,IF(CL=8,VL用!FG31,IF(CL=9,VL用!GB31,VL用!GW31)))))))))","v":34},{"$f":"IF(CL=1,VL用!Q31,IF(CL=2,VL用!AL31,IF(CL=3,VL用!BG31,IF(CL=4,VL用!CB31,IF(CL=5,VL用!CW31,IF(CL=6,VL用!DR31,IF(CL=7,VL用!EM31,IF(CL=8,VL用!FH31,IF(CL=9,VL用!GC31,VL用!GX31)))))))))","v":7},{"$f":"IF(CL=1,VL用!R31,IF(CL=2,VL用!AM31,IF(CL=3,VL用!BH31,IF(CL=4,VL用!CC31,IF(CL=5,VL用!CX31,IF(CL=6,VL用!DS31,IF(CL=7,VL用!EN31,IF(CL=8,VL用!FI31,IF(CL=9,VL用!GD31,VL用!GY31)))))))))","v":8},{"$f":"IF(CL=1,VL用!S31,IF(CL=2,VL用!AN31,IF(CL=3,VL用!BI31,IF(CL=4,VL用!CD31,IF(CL=5,VL用!CY31,IF(CL=6,VL用!DT31,IF(CL=7,VL用!EO31,IF(CL=8,VL用!FJ31,IF(CL=9,VL用!GE31,VL用!GZ31)))))))))","v":3},{"$f":"IF(CL=1,VL用!T31,IF(CL=2,VL用!AO31,IF(CL=3,VL用!BJ31,IF(CL=4,VL用!CE31,IF(CL=5,VL用!CZ31,IF(CL=6,VL用!DU31,IF(CL=7,VL用!EP31,IF(CL=8,VL用!FK31,IF(CL=9,VL用!GF31,VL用!HA31)))))))))","v":0},{"$f":"IF(CL=1,VL用!U31,IF(CL=2,VL用!AP31,IF(CL=3,VL用!BK31,IF(CL=4,VL用!CF31,IF(CL=5,VL用!DA31,IF(CL=6,VL用!DV31,IF(CL=7,VL用!EQ31,IF(CL=8,VL用!FL31,IF(CL=9,VL用!GG31,VL用!HB31)))))))))","v":9},{"$f":"IF(CL=1,VL用!V31,IF(CL=2,VL用!AQ31,IF(CL=3,VL用!BL31,IF(CL=4,VL用!CG31,IF(CL=5,VL用!DB31,IF(CL=6,VL用!DW31,IF(CL=7,VL用!ER31,IF(CL=8,VL用!FM31,IF(CL=9,VL用!GH31,VL用!HC31)))))))))","v":-5},{"$f":"IF(CL=1,VL用!W31,IF(CL=2,VL用!AR31,IF(CL=3,VL用!BM31,IF(CL=4,VL用!CH31,IF(CL=5,VL用!DC31,IF(CL=6,VL用!DX31,IF(CL=7,VL用!ES31,IF(CL=8,VL用!FN31,IF(CL=9,VL用!GI31,VL用!HD31)))))))))","v":10},{"$f":"IF(CL=1,VL用!X31,IF(CL=2,VL用!AS31,IF(CL=3,VL用!BN31,IF(CL=4,VL用!CI31,IF(CL=5,VL用!DD31,IF(CL=6,VL用!DY31,IF(CL=7,VL用!ET31,IF(CL=8,VL用!FO31,IF(CL=9,VL用!GJ31,VL用!HE31)))))))))","v":3},{"$f":"IF(CL=1,VL用!Y31,IF(CL=2,VL用!AT31,IF(CL=3,VL用!BO31,IF(CL=4,VL用!CJ31,IF(CL=5,VL用!DE31,IF(CL=6,VL用!DZ31,IF(CL=7,VL用!EU31,IF(CL=8,VL用!FP31,IF(CL=9,VL用!GK31,VL用!HF31)))))))))","v":0},{"$f":"IF(CL=1,VL用!Z31,IF(CL=2,VL用!AU31,IF(CL=3,VL用!BP31,IF(CL=4,VL用!CK31,IF(CL=5,VL用!DF31,IF(CL=6,VL用!EA31,IF(CL=7,VL用!EV31,IF(CL=8,VL用!FQ31,IF(CL=9,VL用!GL31,VL用!HG31)))))))))","v":0},"マナシールド",null,null,"★","自","ｻﾌﾞ","N体","0-2","自動","NBP",0,{"$f":"\"〈近〉〈遠〉以外の属性を[N+2]個指定し、20C間、その属性D-\"&30+CS!T12*8","v":"〈近〉〈遠〉以外の属性を[N+2]個指定し、20C間、その属性D-30"}]
[null,"鳥人",{"$f":"VL用!B6+CL","v":10},{"$f":"VL用!C6+CL","v":7},{"$f":"VL用!D6+CL","v":14},{"$f":"VL用!E6+CL","v":7},{"$f":"VL用!F6+CL","v":7},{"$f":"\"行動順決定での敏捷に+\"&(CS!T12*3)&\" & 移動ｺｽﾄ-1\"","v":"行動順決定での敏捷に+0 & 移動ｺｽﾄ-1"},null,null,null,null,null,null,null,null,null,null,{"$f":"IF(CL=1,VL用!G32,IF(CL=2,VL用!AB32,IF(CL=3,VL用!AW32,IF(CL=4,VL用!BR32,IF(CL=5,VL用!CM32,IF(CL=6,VL用!DH32,IF(CL=7,VL用!EC32,IF(CL=8,VL用!EX32,IF(CL=9,VL用!FS32,VL用!GN32)))))))))","v":4},{"$f":"IF(CL=1,VL用!H32,IF(CL=2,VL用!AC32,IF(CL=3,VL用!AX32,IF(CL=4,VL用!BS32,IF(CL=5,VL用!CN32,IF(CL=6,VL用!DI32,IF(CL=7,VL用!ED32,IF(CL=8,VL用!EY32,IF(CL=9,VL用!FT32,VL用!GO32)))))))))","v":4},{"$f":"IF(CL=1,VL用!I32,IF(CL=2,VL用!AD32,IF(CL=3,VL用!AY32,IF(CL=4,VL用!BT32,IF(CL=5,VL用!CO32,IF(CL=6,VL用!DJ32,IF(CL=7,VL用!EE32,IF(CL=8,VL用!EZ32,IF(CL=9,VL用!FU32,VL用!GP32)))))))))","v":3},{"$f":"IF(CL=1,VL用!J32,IF(CL=2,VL用!AE32,IF(CL=3,VL用!AZ32,IF(CL=4,VL用!BU32,IF(CL=5,VL用!CP32,IF(CL=6,VL用!DK32,IF(CL=7,VL用!EF32,IF(CL=8,VL用!FA32,IF(CL=9,VL用!FV32,VL用!GQ32)))))))))","v":5},{"$f":"IF(CL=1,VL用!K32,IF(CL=2,VL用!AF32,IF(CL=3,VL用!BA32,IF(CL=4,VL用!BV32,IF(CL=5,VL用!CQ32,IF(CL=6,VL用!DL32,IF(CL=7,VL用!EG32,IF(CL=8,VL用!FB32,IF(CL=9,VL用!FW32,VL用!GR32)))))))))","v":3},{"$f":"IF(CL=1,VL用!L32,IF(CL=2,VL用!AG32,IF(CL=3,VL用!BB32,IF(CL=4,VL用!BW32,IF(CL=5,VL用!CR32,IF(CL=6,VL用!DM32,IF(CL=7,VL用!EH32,IF(CL=8,VL用!FC32,IF(CL=9,VL用!FX32,VL用!GS32)))))))))","v":6},{"$f":"IF(CL=1,VL用!M32,IF(CL=2,VL用!AH32,IF(CL=3,VL用!BC32,IF(CL=4,VL用!BX32,IF(CL=5,VL用!CS32,IF(CL=6,VL用!DN32,IF(CL=7,VL用!EI32,IF(CL=8,VL用!FD32,IF(CL=9,VL用!FY32,VL用!GT32)))))))))","v":6},{"$f":"IF(CL=1,VL用!N32,IF(CL=2,VL用!AI32,IF(CL=3,VL用!BD32,IF(CL=4,VL用!BY32,IF(CL=5,VL用!CT32,IF(CL=6,VL用!DO32,IF(CL=7,VL用!EJ32,IF(CL=8,VL用!FE32,IF(CL=9,VL用!FZ32,VL用!GU32)))))))))","v":6},{"$f":"IF(CL=1,VL用!O32,IF(CL=2,VL用!AJ32,IF(CL=3,VL用!BE32,IF(CL=4,VL用!BZ32,IF(CL=5,VL用!CU32,IF(CL=6,VL用!DP32,IF(CL=7,VL用!EK32,IF(CL=8,VL用!FF32,IF(CL=9,VL用!GA32,VL用!GV32)))))))))","v":92},{"$f":"IF(CL=1,VL用!P32,IF(CL=2,VL用!AK32,IF(CL=3,VL用!BF32,IF(CL=4,VL用!CA32,IF(CL=5,VL用!CV32,IF(CL=6,VL用!DQ32,IF(CL=7,VL用!EL32,IF(CL=8,VL用!FG32,IF(CL=9,VL用!GB32,VL用!GW32)))))))))","v":26},{"$f":"IF(CL=1,VL用!Q32,IF(CL=2,VL用!AL32,IF(CL=3,VL用!BG32,IF(CL=4,VL用!CB32,IF(CL=5,VL用!CW32,IF(CL=6,VL用!DR32,IF(CL=7,VL用!EM32,IF(CL=8,VL用!FH32,IF(CL=9,VL用!GC32,VL用!GX32)))))))))","v":10},{"$f":"IF(CL=1,VL用!R32,IF(CL=2,VL用!AM32,IF(CL=3,VL用!BH32,IF(CL=4,VL用!CC32,IF(CL=5,VL用!CX32,IF(CL=6,VL用!DS32,IF(CL=7,VL用!EN32,IF(CL=8,VL用!FI32,IF(CL=9,VL用!GD32,VL用!GY32)))))))))","v":4},{"$f":"IF(CL=1,VL用!S32,IF(CL=2,VL用!AN32,IF(CL=3,VL用!BI32,IF(CL=4,VL用!CD32,IF(CL=5,VL用!CY32,IF(CL=6,VL用!DT32,IF(CL=7,VL用!EO32,IF(CL=8,VL用!FJ32,IF(CL=9,VL用!GE32,VL用!GZ32)))))))))","v":2},{"$f":"IF(CL=1,VL用!T32,IF(CL=2,VL用!AO32,IF(CL=3,VL用!BJ32,IF(CL=4,VL用!CE32,IF(CL=5,VL用!CZ32,IF(CL=6,VL用!DU32,IF(CL=7,VL用!EP32,IF(CL=8,VL用!FK32,IF(CL=9,VL用!GF32,VL用!HA32)))))))))","v":-10},{"$f":"IF(CL=1,VL用!U32,IF(CL=2,VL用!AP32,IF(CL=3,VL用!BK32,IF(CL=4,VL用!CF32,IF(CL=5,VL用!DA32,IF(CL=6,VL用!DV32,IF(CL=7,VL用!EQ32,IF(CL=8,VL用!FL32,IF(CL=9,VL用!GG32,VL用!HB32)))))))))","v":2},{"$f":"IF(CL=1,VL用!V32,IF(CL=2,VL用!AQ32,IF(CL=3,VL用!BL32,IF(CL=4,VL用!CG32,IF(CL=5,VL用!DB32,IF(CL=6,VL用!DW32,IF(CL=7,VL用!ER32,IF(CL=8,VL用!FM32,IF(CL=9,VL用!GH32,VL用!HC32)))))))))","v":-10},{"$f":"IF(CL=1,VL用!W32,IF(CL=2,VL用!AR32,IF(CL=3,VL用!BM32,IF(CL=4,VL用!CH32,IF(CL=5,VL用!DC32,IF(CL=6,VL用!DX32,IF(CL=7,VL用!ES32,IF(CL=8,VL用!FN32,IF(CL=9,VL用!GI32,VL用!HD32)))))))))","v":10},{"$f":"IF(CL=1,VL用!X32,IF(CL=2,VL用!AS32,IF(CL=3,VL用!BN32,IF(CL=4,VL用!CI32,IF(CL=5,VL用!DD32,IF(CL=6,VL用!DY32,IF(CL=7,VL用!ET32,IF(CL=8,VL用!FO32,IF(CL=9,VL用!GJ32,VL用!HE32)))))))))","v":10},{"$f":"IF(CL=1,VL用!Y32,IF(CL=2,VL用!AT32,IF(CL=3,VL用!BO32,IF(CL=4,VL用!CJ32,IF(CL=5,VL用!DE32,IF(CL=6,VL用!DZ32,IF(CL=7,VL用!EU32,IF(CL=8,VL用!FP32,IF(CL=9,VL用!GK32,VL用!HF32)))))))))","v":0},{"$f":"IF(CL=1,VL用!Z32,IF(CL=2,VL用!AU32,IF(CL=3,VL用!BP32,IF(CL=4,VL用!CK32,IF(CL=5,VL用!DF32,IF(CL=6,VL用!EA32,IF(CL=7,VL用!EV32,IF(CL=8,VL用!FQ32,IF(CL=9,VL用!GL32,VL用!HG32)))))))))","v":-5},"ソニックムーブ",null,null,"★","自","ｵｰﾄ","自","なし","自動","3BP",0,"ｶｳﾝﾄ開始時に使用。即座に行動手番を迎える。"]
[null,"竜人",{"$f":"VL用!B7+CL","v":14},{"$f":"VL用!C7+CL","v":8},{"$f":"VL用!D7+CL","v":6},{"$f":"VL用!E7+CL","v":11},{"$f":"VL用!F7+CL","v":6},"常時F値+3 & 「BS：KB(X)」を70%で無効。",null,null,null,null,null,null,null,null,null,null,{"$f":"IF(CL=1,VL用!G33,IF(CL=2,VL用!AB33,IF(CL=3,VL用!AW33,IF(CL=4,VL用!BR33,IF(CL=5,VL用!CM33,IF(CL=6,VL用!DH33,IF(CL=7,VL用!EC33,IF(CL=8,VL用!EX33,IF(CL=9,VL用!FS33,VL用!GN33)))))))))","v":4},{"$f":"IF(CL=1,VL用!H33,IF(CL=2,VL用!AC33,IF(CL=3,VL用!AX33,IF(CL=4,VL用!BS33,IF(CL=5,VL用!CN33,IF(CL=6,VL用!DI33,IF(CL=7,VL用!ED33,IF(CL=8,VL用!EY33,IF(CL=9,VL用!FT33,VL用!GO33)))))))))","v":3},{"$f":"IF(CL=1,VL用!I33,IF(CL=2,VL用!AD33,IF(CL=3,VL用!AY33,IF(CL=4,VL用!BT33,IF(CL=5,VL用!CO33,IF(CL=6,VL用!DJ33,IF(CL=7,VL用!EE33,IF(CL=8,VL用!EZ33,IF(CL=9,VL用!FU33,VL用!GP33)))))))))","v":2},{"$f":"IF(CL=1,VL用!J33,IF(CL=2,VL用!AE33,IF(CL=3,VL用!AZ33,IF(CL=4,VL用!BU33,IF(CL=5,VL用!CP33,IF(CL=6,VL用!DK33,IF(CL=7,VL用!EF33,IF(CL=8,VL用!FA33,IF(CL=9,VL用!FV33,VL用!GQ33)))))))))","v":4},{"$f":"IF(CL=1,VL用!K33,IF(CL=2,VL用!AF33,IF(CL=3,VL用!BA33,IF(CL=4,VL用!BV33,IF(CL=5,VL用!CQ33,IF(CL=6,VL用!DL33,IF(CL=7,VL用!EG33,IF(CL=8,VL用!FB33,IF(CL=9,VL用!FW33,VL用!GR33)))))))))","v":4},{"$f":"IF(CL=1,VL用!L33,IF(CL=2,VL用!AG33,IF(CL=3,VL用!BB33,IF(CL=4,VL用!BW33,IF(CL=5,VL用!CR33,IF(CL=6,VL用!DM33,IF(CL=7,VL用!EH33,IF(CL=8,VL用!FC33,IF(CL=9,VL用!FX33,VL用!GS33)))))))))","v":0},{"$f":"IF(CL=1,VL用!M33,IF(CL=2,VL用!AH33,IF(CL=3,VL用!BC33,IF(CL=4,VL用!BX33,IF(CL=5,VL用!CS33,IF(CL=6,VL用!DN33,IF(CL=7,VL用!EI33,IF(CL=8,VL用!FD33,IF(CL=9,VL用!FY33,VL用!GT33)))))))))","v":15},{"$f":"IF(CL=1,VL用!N33,IF(CL=2,VL用!AI33,IF(CL=3,VL用!BD33,IF(CL=4,VL用!BY33,IF(CL=5,VL用!CT33,IF(CL=6,VL用!DO33,IF(CL=7,VL用!EJ33,IF(CL=8,VL用!FE33,IF(CL=9,VL用!FZ33,VL用!GU33)))))))))","v":13},{"$f":"IF(CL=1,VL用!O33,IF(CL=2,VL用!AJ33,IF(CL=3,VL用!BE33,IF(CL=4,VL用!BZ33,IF(CL=5,VL用!CU33,IF(CL=6,VL用!DP33,IF(CL=7,VL用!EK33,IF(CL=8,VL用!FF33,IF(CL=9,VL用!GA33,VL用!GV33)))))))))","v":128},{"$f":"IF(CL=1,VL用!P33,IF(CL=2,VL用!AK33,IF(CL=3,VL用!BF33,IF(CL=4,VL用!CA33,IF(CL=5,VL用!CV33,IF(CL=6,VL用!DQ33,IF(CL=7,VL用!EL33,IF(CL=8,VL用!FG33,IF(CL=9,VL用!GB33,VL用!GW33)))))))))","v":15},{"$f":"IF(CL=1,VL用!Q33,IF(CL=2,VL用!AL33,IF(CL=3,VL用!BG33,IF(CL=4,VL用!CB33,IF(CL=5,VL用!CW33,IF(CL=6,VL用!DR33,IF(CL=7,VL用!EM33,IF(CL=8,VL用!FH33,IF(CL=9,VL用!GC33,VL用!GX33)))))))))","v":15},{"$f":"IF(CL=1,VL用!R33,IF(CL=2,VL用!AM33,IF(CL=3,VL用!BH33,IF(CL=4,VL用!CC33,IF(CL=5,VL用!CX33,IF(CL=6,VL用!DS33,IF(CL=7,VL用!EN33,IF(CL=8,VL用!FI33,IF(CL=9,VL用!GD33,VL用!GY33)))))))))","v":12},{"$f":"IF(CL=1,VL用!S33,IF(CL=2,VL用!AN33,IF(CL=3,VL用!BI33,IF(CL=4,VL用!CD33,IF(CL=5,VL用!CY33,IF(CL=6,VL用!DT33,IF(CL=7,VL用!EO33,IF(CL=8,VL用!FJ33,IF(CL=9,VL用!GE33,VL用!GZ33)))))))))","v":17},{"$f":"IF(CL=1,VL用!T33,IF(CL=2,VL用!AO33,IF(CL=3,VL用!BJ33,IF(CL=4,VL用!CE33,IF(CL=5,VL用!CZ33,IF(CL=6,VL用!DU33,IF(CL=7,VL用!EP33,IF(CL=8,VL用!FK33,IF(CL=9,VL用!GF33,VL用!HA33)))))))))","v":14},{"$f":"IF(CL=1,VL用!U33,IF(CL=2,VL用!AP33,IF(CL=3,VL用!BK33,IF(CL=4,VL用!CF33,IF(CL=5,VL用!DA33,IF(CL=6,VL用!DV33,IF(CL=7,VL用!EQ33,IF(CL=8,VL用!FL33,IF(CL=9,VL用!GG33,VL用!HB33)))))))))","v":0},{"$f":"IF(CL=1,VL用!V33,IF(CL=2,VL用!AQ33,IF(CL=3,VL用!BL33,IF(CL=4,VL用!CG33,IF(CL=5,VL用!DB33,IF(CL=6,VL用!DW33,IF(CL=7,VL用!ER33,IF(CL=8,VL用!FM33,IF(CL=9,VL用!GH33,VL用!HC33)))))))))","v":15},{"$f":"IF(CL=1,VL用!W33,IF(CL=2,VL用!AR33,IF(CL=3,VL用!BM33,IF(CL=4,VL用!CH33,IF(CL=5,VL用!DC33,IF(CL=6,VL用!DX33,IF(CL=7,VL用!ES33,IF(CL=8,VL用!FN33,IF(CL=9,VL用!GI33,VL用!HD33)))))))))","v":12},{"$f":"IF(CL=1,VL用!X33,IF(CL=2,VL用!AS33,IF(CL=3,VL用!BN33,IF(CL=4,VL用!CI33,IF(CL=5,VL用!DD33,IF(CL=6,VL用!DY33,IF(CL=7,VL用!ET33,IF(CL=8,VL用!FO33,IF(CL=9,VL用!GJ33,VL用!HE33)))))))))","v":16},{"$f":"IF(CL=1,VL用!Y33,IF(CL=2,VL用!AT33,IF(CL=3,VL用!BO33,IF(CL=4,VL用!CJ33,IF(CL=5,VL用!DE33,IF(CL=6,VL用!DZ33,IF(CL=7,VL用!EU33,IF(CL=8,VL用!FP33,IF(CL=9,VL用!GK33,VL用!HF33)))))))))","v":0},{"$f":"IF(CL=1,VL用!Z33,IF(CL=2,VL用!AU33,IF(CL=3,VL用!BP33,IF(CL=4,VL用!CK33,IF(CL=5,VL用!DF33,IF(CL=6,VL用!EA33,IF(CL=7,VL用!EV33,IF(CL=8,VL用!FQ33,IF(CL=9,VL用!GL33,VL用!HG33)))))))))","v":0},"ドラゴンフォース",null,null,"★","自","ｽﾀｰﾄ","自","なし","自動","NBP",0,{"$f":"\"戦闘中、与えるダメージに+[N×\"&(1+ROUNDUP(CS!T12/3,0))&\"+\"&CS!T12*2&\"]する。\"","v":"戦闘中、与えるダメージに+[N×1+0]する。"}]
[null,"獣人",{"$f":"VL用!B8+CL","v":10},{"$f":"VL用!C8+CL","v":6},{"$f":"VL用!D8+CL","v":15},{"$f":"VL用!E8+CL","v":6},{"$f":"VL用!F8+CL","v":8},"近接攻撃の回避の達成値+2 & 反射判定と回避判定のC値-1 F値3固定。",null,null,null,null,null,null,null,null,null,null,{"$f":"IF(CL=1,VL用!G34,IF(CL=2,VL用!AB34,IF(CL=3,VL用!AW34,IF(CL=4,VL用!BR34,IF(CL=5,VL用!CM34,IF(CL=6,VL用!DH34,IF(CL=7,VL用!EC34,IF(CL=8,VL用!EX34,IF(CL=9,VL用!FS34,VL用!GN34)))))))))","v":4},{"$f":"IF(CL=1,VL用!H34,IF(CL=2,VL用!AC34,IF(CL=3,VL用!AX34,IF(CL=4,VL用!BS34,IF(CL=5,VL用!CN34,IF(CL=6,VL用!DI34,IF(CL=7,VL用!ED34,IF(CL=8,VL用!EY34,IF(CL=9,VL用!FT34,VL用!GO34)))))))))","v":4},{"$f":"IF(CL=1,VL用!I34,IF(CL=2,VL用!AD34,IF(CL=3,VL用!AY34,IF(CL=4,VL用!BT34,IF(CL=5,VL用!CO34,IF(CL=6,VL用!DJ34,IF(CL=7,VL用!EE34,IF(CL=8,VL用!EZ34,IF(CL=9,VL用!FU34,VL用!GP34)))))))))","v":4},{"$f":"IF(CL=1,VL用!J34,IF(CL=2,VL用!AE34,IF(CL=3,VL用!AZ34,IF(CL=4,VL用!BU34,IF(CL=5,VL用!CP34,IF(CL=6,VL用!DK34,IF(CL=7,VL用!EF34,IF(CL=8,VL用!FA34,IF(CL=9,VL用!FV34,VL用!GQ34)))))))))","v":4},{"$f":"IF(CL=1,VL用!K34,IF(CL=2,VL用!AF34,IF(CL=3,VL用!BA34,IF(CL=4,VL用!BV34,IF(CL=5,VL用!CQ34,IF(CL=6,VL用!DL34,IF(CL=7,VL用!EG34,IF(CL=8,VL用!FB34,IF(CL=9,VL用!FW34,VL用!GR34)))))))))","v":3},{"$f":"IF(CL=1,VL用!L34,IF(CL=2,VL用!AG34,IF(CL=3,VL用!BB34,IF(CL=4,VL用!BW34,IF(CL=5,VL用!CR34,IF(CL=6,VL用!DM34,IF(CL=7,VL用!EH34,IF(CL=8,VL用!FC34,IF(CL=9,VL用!FX34,VL用!GS34)))))))))","v":3},{"$f":"IF(CL=1,VL用!M34,IF(CL=2,VL用!AH34,IF(CL=3,VL用!BC34,IF(CL=4,VL用!BX34,IF(CL=5,VL用!CS34,IF(CL=6,VL用!DN34,IF(CL=7,VL用!EI34,IF(CL=8,VL用!FD34,IF(CL=9,VL用!FY34,VL用!GT34)))))))))","v":11},{"$f":"IF(CL=1,VL用!N34,IF(CL=2,VL用!AI34,IF(CL=3,VL用!BD34,IF(CL=4,VL用!BY34,IF(CL=5,VL用!CT34,IF(CL=6,VL用!DO34,IF(CL=7,VL用!EJ34,IF(CL=8,VL用!FE34,IF(CL=9,VL用!FZ34,VL用!GU34)))))))))","v":10},{"$f":"IF(CL=1,VL用!O34,IF(CL=2,VL用!AJ34,IF(CL=3,VL用!BE34,IF(CL=4,VL用!BZ34,IF(CL=5,VL用!CU34,IF(CL=6,VL用!DP34,IF(CL=7,VL用!EK34,IF(CL=8,VL用!FF34,IF(CL=9,VL用!GA34,VL用!GV34)))))))))","v":104},{"$f":"IF(CL=1,VL用!P34,IF(CL=2,VL用!AK34,IF(CL=3,VL用!BF34,IF(CL=4,VL用!CA34,IF(CL=5,VL用!CV34,IF(CL=6,VL用!DQ34,IF(CL=7,VL用!EL34,IF(CL=8,VL用!FG34,IF(CL=9,VL用!GB34,VL用!GW34)))))))))","v":20},{"$f":"IF(CL=1,VL用!Q34,IF(CL=2,VL用!AL34,IF(CL=3,VL用!BG34,IF(CL=4,VL用!CB34,IF(CL=5,VL用!CW34,IF(CL=6,VL用!DR34,IF(CL=7,VL用!EM34,IF(CL=8,VL用!FH34,IF(CL=9,VL用!GC34,VL用!GX34)))))))))","v":9},{"$f":"IF(CL=1,VL用!R34,IF(CL=2,VL用!AM34,IF(CL=3,VL用!BH34,IF(CL=4,VL用!CC34,IF(CL=5,VL用!CX34,IF(CL=6,VL用!DS34,IF(CL=7,VL用!EN34,IF(CL=8,VL用!FI34,IF(CL=9,VL用!GD34,VL用!GY34)))))))))","v":5},{"$f":"IF(CL=1,VL用!S34,IF(CL=2,VL用!AN34,IF(CL=3,VL用!BI34,IF(CL=4,VL用!CD34,IF(CL=5,VL用!CY34,IF(CL=6,VL用!DT34,IF(CL=7,VL用!EO34,IF(CL=8,VL用!FJ34,IF(CL=9,VL用!GE34,VL用!GZ34)))))))))","v":-8},{"$f":"IF(CL=1,VL用!T34,IF(CL=2,VL用!AO34,IF(CL=3,VL用!BJ34,IF(CL=4,VL用!CE34,IF(CL=5,VL用!CZ34,IF(CL=6,VL用!DU34,IF(CL=7,VL用!EP34,IF(CL=8,VL用!FK34,IF(CL=9,VL用!GF34,VL用!HA34)))))))))","v":6},{"$f":"IF(CL=1,VL用!U34,IF(CL=2,VL用!AP34,IF(CL=3,VL用!BK34,IF(CL=4,VL用!CF34,IF(CL=5,VL用!DA34,IF(CL=6,VL用!DV34,IF(CL=7,VL用!EQ34,IF(CL=8,VL用!FL34,IF(CL=9,VL用!GG34,VL用!HB34)))))))))","v":1},{"$f":"IF(CL=1,VL用!V34,IF(CL=2,VL用!AQ34,IF(CL=3,VL用!BL34,IF(CL=4,VL用!CG34,IF(CL=5,VL用!DB34,IF(CL=6,VL用!DW34,IF(CL=7,VL用!ER34,IF(CL=8,VL用!FM34,IF(CL=9,VL用!GH34,VL用!HC34)))))))))","v":-4},{"$f":"IF(CL=1,VL用!W34,IF(CL=2,VL用!AR34,IF(CL=3,VL用!BM34,IF(CL=4,VL用!CH34,IF(CL=5,VL用!DC34,IF(CL=6,VL用!DX34,IF(CL=7,VL用!ES34,IF(CL=8,VL用!FN34,IF(CL=9,VL用!GI34,VL用!HD34)))))))))","v":3},{"$f":"IF(CL=1,VL用!X34,IF(CL=2,VL用!AS34,IF(CL=3,VL用!BN34,IF(CL=4,VL用!CI34,IF(CL=5,VL用!DD34,IF(CL=6,VL用!DY34,IF(CL=7,VL用!ET34,IF(CL=8,VL用!FO34,IF(CL=9,VL用!GJ34,VL用!HE34)))))))))","v":11},{"$f":"IF(CL=1,VL用!Y34,IF(CL=2,VL用!AT34,IF(CL=3,VL用!BO34,IF(CL=4,VL用!CJ34,IF(CL=5,VL用!DE34,IF(CL=6,VL用!DZ34,IF(CL=7,VL用!EU34,IF(CL=8,VL用!FP34,IF(CL=9,VL用!GK34,VL用!HF34)))))))))","v":2},{"$f":"IF(CL=1,VL用!Z34,IF(CL=2,VL用!AU34,IF(CL=3,VL用!BP34,IF(CL=4,VL用!CK34,IF(CL=5,VL用!DF34,IF(CL=6,VL用!EA34,IF(CL=7,VL用!EV34,IF(CL=8,VL用!FQ34,IF(CL=9,VL用!GL34,VL用!HG34)))))))))","v":2},"ワイルドラッシュ",null,null,"★","自","ｵｰﾄ","自","なし","自動","6BP",0,"行動手番後使用。追加ﾒｲﾝを得て攻撃を行う。そのときのｺｽﾄに-5する。"]
[null,"吸血鬼",{"$f":"VL用!B9+CL","v":13},{"$f":"VL用!C9+CL","v":6},{"$f":"VL用!D9+CL","v":10},{"$f":"VL用!E9+CL","v":10},{"$f":"VL用!F9+CL","v":6},{"$f":"\"ﾀﾞﾒｰｼﾞを与えた時または10ｶｳﾝﾄ毎に、HPを\"&(CS!T12*3+10)&\"点回復する。\"","v":"ﾀﾞﾒｰｼﾞを与えた時または10ｶｳﾝﾄ毎に、HPを10点回復する。"},null,null,null,null,null,null,null,null,null,null,{"$f":"IF(CL=1,VL用!G35,IF(CL=2,VL用!AB35,IF(CL=3,VL用!AW35,IF(CL=4,VL用!BR35,IF(CL=5,VL用!CM35,IF(CL=6,VL用!DH35,IF(CL=7,VL用!EC35,IF(CL=8,VL用!EX35,IF(CL=9,VL用!FS35,VL用!GN35)))))))))","v":4},{"$f":"IF(CL=1,VL用!H35,IF(CL=2,VL用!AC35,IF(CL=3,VL用!AX35,IF(CL=4,VL用!BS35,IF(CL=5,VL用!CN35,IF(CL=6,VL用!DI35,IF(CL=7,VL用!ED35,IF(CL=8,VL用!EY35,IF(CL=9,VL用!FT35,VL用!GO35)))))))))","v":3},{"$f":"IF(CL=1,VL用!I35,IF(CL=2,VL用!AD35,IF(CL=3,VL用!AY35,IF(CL=4,VL用!BT35,IF(CL=5,VL用!CO35,IF(CL=6,VL用!DJ35,IF(CL=7,VL用!EE35,IF(CL=8,VL用!EZ35,IF(CL=9,VL用!FU35,VL用!GP35)))))))))","v":3},{"$f":"IF(CL=1,VL用!J35,IF(CL=2,VL用!AE35,IF(CL=3,VL用!AZ35,IF(CL=4,VL用!BU35,IF(CL=5,VL用!CP35,IF(CL=6,VL用!DK35,IF(CL=7,VL用!EF35,IF(CL=8,VL用!FA35,IF(CL=9,VL用!FV35,VL用!GQ35)))))))))","v":4},{"$f":"IF(CL=1,VL用!K35,IF(CL=2,VL用!AF35,IF(CL=3,VL用!BA35,IF(CL=4,VL用!BV35,IF(CL=5,VL用!CQ35,IF(CL=6,VL用!DL35,IF(CL=7,VL用!EG35,IF(CL=8,VL用!FB35,IF(CL=9,VL用!FW35,VL用!GR35)))))))))","v":3},{"$f":"IF(CL=1,VL用!L35,IF(CL=2,VL用!AG35,IF(CL=3,VL用!BB35,IF(CL=4,VL用!BW35,IF(CL=5,VL用!CR35,IF(CL=6,VL用!DM35,IF(CL=7,VL用!EH35,IF(CL=8,VL用!FC35,IF(CL=9,VL用!FX35,VL用!GS35)))))))))","v":5},{"$f":"IF(CL=1,VL用!M35,IF(CL=2,VL用!AH35,IF(CL=3,VL用!BC35,IF(CL=4,VL用!BX35,IF(CL=5,VL用!CS35,IF(CL=6,VL用!DN35,IF(CL=7,VL用!EI35,IF(CL=8,VL用!FD35,IF(CL=9,VL用!FY35,VL用!GT35)))))))))","v":11},{"$f":"IF(CL=1,VL用!N35,IF(CL=2,VL用!AI35,IF(CL=3,VL用!BD35,IF(CL=4,VL用!BY35,IF(CL=5,VL用!CT35,IF(CL=6,VL用!DO35,IF(CL=7,VL用!EJ35,IF(CL=8,VL用!FE35,IF(CL=9,VL用!FZ35,VL用!GU35)))))))))","v":10},{"$f":"IF(CL=1,VL用!O35,IF(CL=2,VL用!AJ35,IF(CL=3,VL用!BE35,IF(CL=4,VL用!BZ35,IF(CL=5,VL用!CU35,IF(CL=6,VL用!DP35,IF(CL=7,VL用!EK35,IF(CL=8,VL用!FF35,IF(CL=9,VL用!GA35,VL用!GV35)))))))))","v":120},{"$f":"IF(CL=1,VL用!P35,IF(CL=2,VL用!AK35,IF(CL=3,VL用!BF35,IF(CL=4,VL用!CA35,IF(CL=5,VL用!CV35,IF(CL=6,VL用!DQ35,IF(CL=7,VL用!EL35,IF(CL=8,VL用!FG35,IF(CL=9,VL用!GB35,VL用!GW35)))))))))","v":25},{"$f":"IF(CL=1,VL用!Q35,IF(CL=2,VL用!AL35,IF(CL=3,VL用!BG35,IF(CL=4,VL用!CB35,IF(CL=5,VL用!CW35,IF(CL=6,VL用!DR35,IF(CL=7,VL用!EM35,IF(CL=8,VL用!FH35,IF(CL=9,VL用!GC35,VL用!GX35)))))))))","v":13},{"$f":"IF(CL=1,VL用!R35,IF(CL=2,VL用!AM35,IF(CL=3,VL用!BH35,IF(CL=4,VL用!CC35,IF(CL=5,VL用!CX35,IF(CL=6,VL用!DS35,IF(CL=7,VL用!EN35,IF(CL=8,VL用!FI35,IF(CL=9,VL用!GD35,VL用!GY35)))))))))","v":13},{"$f":"IF(CL=1,VL用!S35,IF(CL=2,VL用!AN35,IF(CL=3,VL用!BI35,IF(CL=4,VL用!CD35,IF(CL=5,VL用!CY35,IF(CL=6,VL用!DT35,IF(CL=7,VL用!EO35,IF(CL=8,VL用!FJ35,IF(CL=9,VL用!GE35,VL用!GZ35)))))))))","v":-35},{"$f":"IF(CL=1,VL用!T35,IF(CL=2,VL用!AO35,IF(CL=3,VL用!BJ35,IF(CL=4,VL用!CE35,IF(CL=5,VL用!CZ35,IF(CL=6,VL用!DU35,IF(CL=7,VL用!EP35,IF(CL=8,VL用!FK35,IF(CL=9,VL用!GF35,VL用!HA35)))))))))","v":5},{"$f":"IF(CL=1,VL用!U35,IF(CL=2,VL用!AP35,IF(CL=3,VL用!BK35,IF(CL=4,VL用!CF35,IF(CL=5,VL用!DA35,IF(CL=6,VL用!DV35,IF(CL=7,VL用!EQ35,IF(CL=8,VL用!FL35,IF(CL=9,VL用!GG35,VL用!HB35)))))))))","v":-30},{"$f":"IF(CL=1,VL用!V35,IF(CL=2,VL用!AQ35,IF(CL=3,VL用!BL35,IF(CL=4,VL用!CG35,IF(CL=5,VL用!DB35,IF(CL=6,VL用!DW35,IF(CL=7,VL用!ER35,IF(CL=8,VL用!FM35,IF(CL=9,VL用!GH35,VL用!HC35)))))))))","v":3},{"$f":"IF(CL=1,VL用!W35,IF(CL=2,VL用!AR35,IF(CL=3,VL用!BM35,IF(CL=4,VL用!CH35,IF(CL=5,VL用!DC35,IF(CL=6,VL用!DX35,IF(CL=7,VL用!ES35,IF(CL=8,VL用!FN35,IF(CL=9,VL用!GI35,VL用!HD35)))))))))","v":4},{"$f":"IF(CL=1,VL用!X35,IF(CL=2,VL用!AS35,IF(CL=3,VL用!BN35,IF(CL=4,VL用!CI35,IF(CL=5,VL用!DD35,IF(CL=6,VL用!DY35,IF(CL=7,VL用!ET35,IF(CL=8,VL用!FO35,IF(CL=9,VL用!GJ35,VL用!HE35)))))))))","v":2},{"$f":"IF(CL=1,VL用!Y35,IF(CL=2,VL用!AT35,IF(CL=3,VL用!BO35,IF(CL=4,VL用!CJ35,IF(CL=5,VL用!DE35,IF(CL=6,VL用!DZ35,IF(CL=7,VL用!EU35,IF(CL=8,VL用!FP35,IF(CL=9,VL用!GK35,VL用!HF35)))))))))","v":-35},{"$f":"IF(CL=1,VL用!Z35,IF(CL=2,VL用!AU35,IF(CL=3,VL用!BP35,IF(CL=4,VL用!CK35,IF(CL=5,VL用!DF35,IF(CL=6,VL用!EA35,IF(CL=7,VL用!EV35,IF(CL=8,VL用!FQ35,IF(CL=9,VL用!GL35,VL用!HG35)))))))))","v":26},"鮮血の一撃",null,null,"★","自","ﾀﾞﾒﾛ","自","なし","自動","3BP",0,"ダメージロールで振るダイスの目を全て最大値にする。"]
[null,"偽人",{"$f":"VL用!B10+CL","v":6},{"$f":"VL用!C10+CL","v":8},{"$f":"VL用!D10+CL","v":7},{"$f":"VL用!E10+CL","v":13},{"$f":"VL用!F10+CL","v":11},"人間以外のキメラ不可。",null,null,null,null,null,null,null,null,null,null,{"$f":"IF(CL=1,VL用!G36,IF(CL=2,VL用!AB36,IF(CL=3,VL用!AW36,IF(CL=4,VL用!BR36,IF(CL=5,VL用!CM36,IF(CL=6,VL用!DH36,IF(CL=7,VL用!EC36,IF(CL=8,VL用!EX36,IF(CL=9,VL用!FS36,VL用!GN36)))))))))","v":5},{"$f":"IF(CL=1,VL用!H36,IF(CL=2,VL用!AC36,IF(CL=3,VL用!AX36,IF(CL=4,VL用!BS36,IF(CL=5,VL用!CN36,IF(CL=6,VL用!DI36,IF(CL=7,VL用!ED36,IF(CL=8,VL用!EY36,IF(CL=9,VL用!FT36,VL用!GO36)))))))))","v":5},{"$f":"IF(CL=1,VL用!I36,IF(CL=2,VL用!AD36,IF(CL=3,VL用!AY36,IF(CL=4,VL用!BT36,IF(CL=5,VL用!CO36,IF(CL=6,VL用!DJ36,IF(CL=7,VL用!EE36,IF(CL=8,VL用!EZ36,IF(CL=9,VL用!FU36,VL用!GP36)))))))))","v":3},{"$f":"IF(CL=1,VL用!J36,IF(CL=2,VL用!AE36,IF(CL=3,VL用!AZ36,IF(CL=4,VL用!BU36,IF(CL=5,VL用!CP36,IF(CL=6,VL用!DK36,IF(CL=7,VL用!EF36,IF(CL=8,VL用!FA36,IF(CL=9,VL用!FV36,VL用!GQ36)))))))))","v":4},{"$f":"IF(CL=1,VL用!K36,IF(CL=2,VL用!AF36,IF(CL=3,VL用!BA36,IF(CL=4,VL用!BV36,IF(CL=5,VL用!CQ36,IF(CL=6,VL用!DL36,IF(CL=7,VL用!EG36,IF(CL=8,VL用!FB36,IF(CL=9,VL用!FW36,VL用!GR36)))))))))","v":3},{"$f":"IF(CL=1,VL用!L36,IF(CL=2,VL用!AG36,IF(CL=3,VL用!BB36,IF(CL=4,VL用!BW36,IF(CL=5,VL用!CR36,IF(CL=6,VL用!DM36,IF(CL=7,VL用!EH36,IF(CL=8,VL用!FC36,IF(CL=9,VL用!FX36,VL用!GS36)))))))))","v":4},{"$f":"IF(CL=1,VL用!M36,IF(CL=2,VL用!AH36,IF(CL=3,VL用!BC36,IF(CL=4,VL用!BX36,IF(CL=5,VL用!CS36,IF(CL=6,VL用!DN36,IF(CL=7,VL用!EI36,IF(CL=8,VL用!FD36,IF(CL=9,VL用!FY36,VL用!GT36)))))))))","v":10},{"$f":"IF(CL=1,VL用!N36,IF(CL=2,VL用!AI36,IF(CL=3,VL用!BD36,IF(CL=4,VL用!BY36,IF(CL=5,VL用!CT36,IF(CL=6,VL用!DO36,IF(CL=7,VL用!EJ36,IF(CL=8,VL用!FE36,IF(CL=9,VL用!FZ36,VL用!GU36)))))))))","v":10},{"$f":"IF(CL=1,VL用!O36,IF(CL=2,VL用!AJ36,IF(CL=3,VL用!BE36,IF(CL=4,VL用!BZ36,IF(CL=5,VL用!CU36,IF(CL=6,VL用!DP36,IF(CL=7,VL用!EK36,IF(CL=8,VL用!FF36,IF(CL=9,VL用!GA36,VL用!GV36)))))))))","v":100},{"$f":"IF(CL=1,VL用!P36,IF(CL=2,VL用!AK36,IF(CL=3,VL用!BF36,IF(CL=4,VL用!CA36,IF(CL=5,VL用!CV36,IF(CL=6,VL用!DQ36,IF(CL=7,VL用!EL36,IF(CL=8,VL用!FG36,IF(CL=9,VL用!GB36,VL用!GW36)))))))))","v":30},{"$f":"IF(CL=1,VL用!Q36,IF(CL=2,VL用!AL36,IF(CL=3,VL用!BG36,IF(CL=4,VL用!CB36,IF(CL=5,VL用!CW36,IF(CL=6,VL用!DR36,IF(CL=7,VL用!EM36,IF(CL=8,VL用!FH36,IF(CL=9,VL用!GC36,VL用!GX36)))))))))","v":10},{"$f":"IF(CL=1,VL用!R36,IF(CL=2,VL用!AM36,IF(CL=3,VL用!BH36,IF(CL=4,VL用!CC36,IF(CL=5,VL用!CX36,IF(CL=6,VL用!DS36,IF(CL=7,VL用!EN36,IF(CL=8,VL用!FI36,IF(CL=9,VL用!GD36,VL用!GY36)))))))))","v":10},{"$f":"IF(CL=1,VL用!S36,IF(CL=2,VL用!AN36,IF(CL=3,VL用!BI36,IF(CL=4,VL用!CD36,IF(CL=5,VL用!CY36,IF(CL=6,VL用!DT36,IF(CL=7,VL用!EO36,IF(CL=8,VL用!FJ36,IF(CL=9,VL用!GE36,VL用!GZ36)))))))))","v":0},{"$f":"IF(CL=1,VL用!T36,IF(CL=2,VL用!AO36,IF(CL=3,VL用!BJ36,IF(CL=4,VL用!CE36,IF(CL=5,VL用!CZ36,IF(CL=6,VL用!DU36,IF(CL=7,VL用!EP36,IF(CL=8,VL用!FK36,IF(CL=9,VL用!GF36,VL用!HA36)))))))))","v":0},{"$f":"IF(CL=1,VL用!U36,IF(CL=2,VL用!AP36,IF(CL=3,VL用!BK36,IF(CL=4,VL用!CF36,IF(CL=5,VL用!DA36,IF(CL=6,VL用!DV36,IF(CL=7,VL用!EQ36,IF(CL=8,VL用!FL36,IF(CL=9,VL用!GG36,VL用!HB36)))))))))","v":-5},{"$f":"IF(CL=1,VL用!V36,IF(CL=2,VL用!AQ36,IF(CL=3,VL用!BL36,IF(CL=4,VL用!CG36,IF(CL=5,VL用!DB36,IF(CL=6,VL用!DW36,IF(CL=7,VL用!ER36,IF(CL=8,VL用!FM36,IF(CL=9,VL用!GH36,VL用!HC36)))))))))","v":0},{"$f":"IF(CL=1,VL用!W36,IF(CL=2,VL用!AR36,IF(CL=3,VL用!BM36,IF(CL=4,VL用!CH36,IF(CL=5,VL用!DC36,IF(CL=6,VL用!DX36,IF(CL=7,VL用!ES36,IF(CL=8,VL用!FN36,IF(CL=9,VL用!GI36,VL用!HD36)))))))))","v":5},{"$f":"IF(CL=1,VL用!X36,IF(CL=2,VL用!AS36,IF(CL=3,VL用!BN36,IF(CL=4,VL用!CI36,IF(CL=5,VL用!DD36,IF(CL=6,VL用!DY36,IF(CL=7,VL用!ET36,IF(CL=8,VL用!FO36,IF(CL=9,VL用!GJ36,VL用!HE36)))))))))","v":2},{"$f":"IF(CL=1,VL用!Y36,IF(CL=2,VL用!AT36,IF(CL=3,VL用!BO36,IF(CL=4,VL用!CJ36,IF(CL=5,VL用!DE36,IF(CL=6,VL用!DZ36,IF(CL=7,VL用!EU36,IF(CL=8,VL用!FP36,IF(CL=9,VL用!GK36,VL用!HF36)))))))))","v":4},{"$f":"IF(CL=1,VL用!Z36,IF(CL=2,VL用!AU36,IF(CL=3,VL用!BP36,IF(CL=4,VL用!CK36,IF(CL=5,VL用!DF36,IF(CL=6,VL用!EA36,IF(CL=7,VL用!EV36,IF(CL=8,VL用!FQ36,IF(CL=9,VL用!GL36,VL用!HG36)))))))))","v":3},"真姿解放",null,null,"★","自","ｵｰﾄ","自","なし","自動","2BP",0,"いつでも使用可。あなたは[解放状態]となる。"]
[null,"魔法人形",{"$f":"VL用!B11+CL","v":6},{"$f":"VL用!C11+CL","v":11},{"$f":"VL用!D11+CL","v":6},{"$f":"VL用!E11+CL","v":11},{"$f":"VL用!F11+CL","v":11},{"$f":"\"「種別：魔」の被ﾀﾞﾒ-\"&10+CS!T12*3&\" & 準備期間を-1してコスト+1\"","v":"「種別：魔」の被ﾀﾞﾒ-10 & 準備期間を-1してコスト+1"},null,null,null,null,null,null,null,null,null,null,{"$f":"IF(CL=1,VL用!G37,IF(CL=2,VL用!AB37,IF(CL=3,VL用!AW37,IF(CL=4,VL用!BR37,IF(CL=5,VL用!CM37,IF(CL=6,VL用!DH37,IF(CL=7,VL用!EC37,IF(CL=8,VL用!EX37,IF(CL=9,VL用!FS37,VL用!GN37)))))))))","v":4},{"$f":"IF(CL=1,VL用!H37,IF(CL=2,VL用!AC37,IF(CL=3,VL用!AX37,IF(CL=4,VL用!BS37,IF(CL=5,VL用!CN37,IF(CL=6,VL用!DI37,IF(CL=7,VL用!ED37,IF(CL=8,VL用!EY37,IF(CL=9,VL用!FT37,VL用!GO37)))))))))","v":3},{"$f":"IF(CL=1,VL用!I37,IF(CL=2,VL用!AD37,IF(CL=3,VL用!AY37,IF(CL=4,VL用!BT37,IF(CL=5,VL用!CO37,IF(CL=6,VL用!DJ37,IF(CL=7,VL用!EE37,IF(CL=8,VL用!EZ37,IF(CL=9,VL用!FU37,VL用!GP37)))))))))","v":3},{"$f":"IF(CL=1,VL用!J37,IF(CL=2,VL用!AE37,IF(CL=3,VL用!AZ37,IF(CL=4,VL用!BU37,IF(CL=5,VL用!CP37,IF(CL=6,VL用!DK37,IF(CL=7,VL用!EF37,IF(CL=8,VL用!FA37,IF(CL=9,VL用!FV37,VL用!GQ37)))))))))","v":5},{"$f":"IF(CL=1,VL用!K37,IF(CL=2,VL用!AF37,IF(CL=3,VL用!BA37,IF(CL=4,VL用!BV37,IF(CL=5,VL用!CQ37,IF(CL=6,VL用!DL37,IF(CL=7,VL用!EG37,IF(CL=8,VL用!FB37,IF(CL=9,VL用!FW37,VL用!GR37)))))))))","v":4},{"$f":"IF(CL=1,VL用!L37,IF(CL=2,VL用!AG37,IF(CL=3,VL用!BB37,IF(CL=4,VL用!BW37,IF(CL=5,VL用!CR37,IF(CL=6,VL用!DM37,IF(CL=7,VL用!EH37,IF(CL=8,VL用!FC37,IF(CL=9,VL用!FX37,VL用!GS37)))))))))","v":4},{"$f":"IF(CL=1,VL用!M37,IF(CL=2,VL用!AH37,IF(CL=3,VL用!BC37,IF(CL=4,VL用!BX37,IF(CL=5,VL用!CS37,IF(CL=6,VL用!DN37,IF(CL=7,VL用!EI37,IF(CL=8,VL用!FD37,IF(CL=9,VL用!FY37,VL用!GT37)))))))))","v":7},{"$f":"IF(CL=1,VL用!N37,IF(CL=2,VL用!AI37,IF(CL=3,VL用!BD37,IF(CL=4,VL用!BY37,IF(CL=5,VL用!CT37,IF(CL=6,VL用!DO37,IF(CL=7,VL用!EJ37,IF(CL=8,VL用!FE37,IF(CL=9,VL用!FZ37,VL用!GU37)))))))))","v":18},{"$f":"IF(CL=1,VL用!O37,IF(CL=2,VL用!AJ37,IF(CL=3,VL用!BE37,IF(CL=4,VL用!BZ37,IF(CL=5,VL用!CU37,IF(CL=6,VL用!DP37,IF(CL=7,VL用!EK37,IF(CL=8,VL用!FF37,IF(CL=9,VL用!GA37,VL用!GV37)))))))))","v":50},{"$f":"IF(CL=1,VL用!P37,IF(CL=2,VL用!AK37,IF(CL=3,VL用!BF37,IF(CL=4,VL用!CA37,IF(CL=5,VL用!CV37,IF(CL=6,VL用!DQ37,IF(CL=7,VL用!EL37,IF(CL=8,VL用!FG37,IF(CL=9,VL用!GB37,VL用!GW37)))))))))","v":44},{"$f":"IF(CL=1,VL用!Q37,IF(CL=2,VL用!AL37,IF(CL=3,VL用!BG37,IF(CL=4,VL用!CB37,IF(CL=5,VL用!CW37,IF(CL=6,VL用!DR37,IF(CL=7,VL用!EM37,IF(CL=8,VL用!FH37,IF(CL=9,VL用!GC37,VL用!GX37)))))))))","v":3},{"$f":"IF(CL=1,VL用!R37,IF(CL=2,VL用!AM37,IF(CL=3,VL用!BH37,IF(CL=4,VL用!CC37,IF(CL=5,VL用!CX37,IF(CL=6,VL用!DS37,IF(CL=7,VL用!EN37,IF(CL=8,VL用!FI37,IF(CL=9,VL用!GD37,VL用!GY37)))))))))","v":2},{"$f":"IF(CL=1,VL用!S37,IF(CL=2,VL用!AN37,IF(CL=3,VL用!BI37,IF(CL=4,VL用!CD37,IF(CL=5,VL用!CY37,IF(CL=6,VL用!DT37,IF(CL=7,VL用!EO37,IF(CL=8,VL用!FJ37,IF(CL=9,VL用!GE37,VL用!GZ37)))))))))","v":20},{"$f":"IF(CL=1,VL用!T37,IF(CL=2,VL用!AO37,IF(CL=3,VL用!BJ37,IF(CL=4,VL用!CE37,IF(CL=5,VL用!CZ37,IF(CL=6,VL用!DU37,IF(CL=7,VL用!EP37,IF(CL=8,VL用!FK37,IF(CL=9,VL用!GF37,VL用!HA37)))))))))","v":20},{"$f":"IF(CL=1,VL用!U37,IF(CL=2,VL用!AP37,IF(CL=3,VL用!BK37,IF(CL=4,VL用!CF37,IF(CL=5,VL用!DA37,IF(CL=6,VL用!DV37,IF(CL=7,VL用!EQ37,IF(CL=8,VL用!FL37,IF(CL=9,VL用!GG37,VL用!HB37)))))))))","v":20},{"$f":"IF(CL=1,VL用!V37,IF(CL=2,VL用!AQ37,IF(CL=3,VL用!BL37,IF(CL=4,VL用!CG37,IF(CL=5,VL用!DB37,IF(CL=6,VL用!DW37,IF(CL=7,VL用!ER37,IF(CL=8,VL用!FM37,IF(CL=9,VL用!GH37,VL用!HC37)))))))))","v":20},{"$f":"IF(CL=1,VL用!W37,IF(CL=2,VL用!AR37,IF(CL=3,VL用!BM37,IF(CL=4,VL用!CH37,IF(CL=5,VL用!DC37,IF(CL=6,VL用!DX37,IF(CL=7,VL用!ES37,IF(CL=8,VL用!FN37,IF(CL=9,VL用!GI37,VL用!HD37)))))))))","v":10},{"$f":"IF(CL=1,VL用!X37,IF(CL=2,VL用!AS37,IF(CL=3,VL用!BN37,IF(CL=4,VL用!CI37,IF(CL=5,VL用!DD37,IF(CL=6,VL用!DY37,IF(CL=7,VL用!ET37,IF(CL=8,VL用!FO37,IF(CL=9,VL用!GJ37,VL用!HE37)))))))))","v":5},{"$f":"IF(CL=1,VL用!Y37,IF(CL=2,VL用!AT37,IF(CL=3,VL用!BO37,IF(CL=4,VL用!CJ37,IF(CL=5,VL用!DE37,IF(CL=6,VL用!DZ37,IF(CL=7,VL用!EU37,IF(CL=8,VL用!FP37,IF(CL=9,VL用!GK37,VL用!HF37)))))))))","v":6},{"$f":"IF(CL=1,VL用!Z37,IF(CL=2,VL用!AU37,IF(CL=3,VL用!BP37,IF(CL=4,VL用!CK37,IF(CL=5,VL用!DF37,IF(CL=6,VL用!EA37,IF(CL=7,VL用!EV37,IF(CL=8,VL用!FQ37,IF(CL=9,VL用!GL37,VL用!HG37)))))))))","v":6},"エナジーバースト",null,null,"★","自","ｵｰﾄ","自","なし","自動","5BP",0,"C開始時に使用。次判定達成値+10 与D+[物攻or魔攻] C終了後HP0。"]
[null,"死神",{"$f":"VL用!B12+CL","v":12},{"$f":"VL用!C12+CL","v":9},{"$f":"VL用!D12+CL","v":10},{"$f":"VL用!E12+CL","v":8},{"$f":"VL用!F12+CL","v":6},{"$f":"\"攻撃全てに「BS：即死(\"&CS!T12*5&\")」付与。 & ﾀﾞﾒｰｼﾞ+[現ｶｳﾝﾄ/5(↓)」\"","v":"攻撃全てに「BS：即死(0)」付与。 & ﾀﾞﾒｰｼﾞ+[現ｶｳﾝﾄ/5(↓)」"},null,null,null,null,null,null,null,null,null,null,{"$f":"IF(CL=1,VL用!G38,IF(CL=2,VL用!AB38,IF(CL=3,VL用!AW38,IF(CL=4,VL用!BR38,IF(CL=5,VL用!CM38,IF(CL=6,VL用!DH38,IF(CL=7,VL用!EC38,IF(CL=8,VL用!EX38,IF(CL=9,VL用!FS38,VL用!GN38)))))))))","v":5},{"$f":"IF(CL=1,VL用!H38,IF(CL=2,VL用!AC38,IF(CL=3,VL用!AX38,IF(CL=4,VL用!BS38,IF(CL=5,VL用!CN38,IF(CL=6,VL用!DI38,IF(CL=7,VL用!ED38,IF(CL=8,VL用!EY38,IF(CL=9,VL用!FT38,VL用!GO38)))))))))","v":2},{"$f":"IF(CL=1,VL用!I38,IF(CL=2,VL用!AD38,IF(CL=3,VL用!AY38,IF(CL=4,VL用!BT38,IF(CL=5,VL用!CO38,IF(CL=6,VL用!DJ38,IF(CL=7,VL用!EE38,IF(CL=8,VL用!EZ38,IF(CL=9,VL用!FU38,VL用!GP38)))))))))","v":3},{"$f":"IF(CL=1,VL用!J38,IF(CL=2,VL用!AE38,IF(CL=3,VL用!AZ38,IF(CL=4,VL用!BU38,IF(CL=5,VL用!CP38,IF(CL=6,VL用!DK38,IF(CL=7,VL用!EF38,IF(CL=8,VL用!FA38,IF(CL=9,VL用!FV38,VL用!GQ38)))))))))","v":5},{"$f":"IF(CL=1,VL用!K38,IF(CL=2,VL用!AF38,IF(CL=3,VL用!BA38,IF(CL=4,VL用!BV38,IF(CL=5,VL用!CQ38,IF(CL=6,VL用!DL38,IF(CL=7,VL用!EG38,IF(CL=8,VL用!FB38,IF(CL=9,VL用!FW38,VL用!GR38)))))))))","v":3},{"$f":"IF(CL=1,VL用!L38,IF(CL=2,VL用!AG38,IF(CL=3,VL用!BB38,IF(CL=4,VL用!BW38,IF(CL=5,VL用!CR38,IF(CL=6,VL用!DM38,IF(CL=7,VL用!EH38,IF(CL=8,VL用!FC38,IF(CL=9,VL用!FX38,VL用!GS38)))))))))","v":3},{"$f":"IF(CL=1,VL用!M38,IF(CL=2,VL用!AH38,IF(CL=3,VL用!BC38,IF(CL=4,VL用!BX38,IF(CL=5,VL用!CS38,IF(CL=6,VL用!DN38,IF(CL=7,VL用!EI38,IF(CL=8,VL用!FD38,IF(CL=9,VL用!FY38,VL用!GT38)))))))))","v":6},{"$f":"IF(CL=1,VL用!N38,IF(CL=2,VL用!AI38,IF(CL=3,VL用!BD38,IF(CL=4,VL用!BY38,IF(CL=5,VL用!CT38,IF(CL=6,VL用!DO38,IF(CL=7,VL用!EJ38,IF(CL=8,VL用!FE38,IF(CL=9,VL用!FZ38,VL用!GU38)))))))))","v":6},{"$f":"IF(CL=1,VL用!O38,IF(CL=2,VL用!AJ38,IF(CL=3,VL用!BE38,IF(CL=4,VL用!BZ38,IF(CL=5,VL用!CU38,IF(CL=6,VL用!DP38,IF(CL=7,VL用!EK38,IF(CL=8,VL用!FF38,IF(CL=9,VL用!GA38,VL用!GV38)))))))))","v":90},{"$f":"IF(CL=1,VL用!P38,IF(CL=2,VL用!AK38,IF(CL=3,VL用!BF38,IF(CL=4,VL用!CA38,IF(CL=5,VL用!CV38,IF(CL=6,VL用!DQ38,IF(CL=7,VL用!EL38,IF(CL=8,VL用!FG38,IF(CL=9,VL用!GB38,VL用!GW38)))))))))","v":28},{"$f":"IF(CL=1,VL用!Q38,IF(CL=2,VL用!AL38,IF(CL=3,VL用!BG38,IF(CL=4,VL用!CB38,IF(CL=5,VL用!CW38,IF(CL=6,VL用!DR38,IF(CL=7,VL用!EM38,IF(CL=8,VL用!FH38,IF(CL=9,VL用!GC38,VL用!GX38)))))))))","v":9},{"$f":"IF(CL=1,VL用!R38,IF(CL=2,VL用!AM38,IF(CL=3,VL用!BH38,IF(CL=4,VL用!CC38,IF(CL=5,VL用!CX38,IF(CL=6,VL用!DS38,IF(CL=7,VL用!EN38,IF(CL=8,VL用!FI38,IF(CL=9,VL用!GD38,VL用!GY38)))))))))","v":9},{"$f":"IF(CL=1,VL用!S38,IF(CL=2,VL用!AN38,IF(CL=3,VL用!BI38,IF(CL=4,VL用!CD38,IF(CL=5,VL用!CY38,IF(CL=6,VL用!DT38,IF(CL=7,VL用!EO38,IF(CL=8,VL用!FJ38,IF(CL=9,VL用!GE38,VL用!GZ38)))))))))","v":8},{"$f":"IF(CL=1,VL用!T38,IF(CL=2,VL用!AO38,IF(CL=3,VL用!BJ38,IF(CL=4,VL用!CE38,IF(CL=5,VL用!CZ38,IF(CL=6,VL用!DU38,IF(CL=7,VL用!EP38,IF(CL=8,VL用!FK38,IF(CL=9,VL用!GF38,VL用!HA38)))))))))","v":0},{"$f":"IF(CL=1,VL用!U38,IF(CL=2,VL用!AP38,IF(CL=3,VL用!BK38,IF(CL=4,VL用!CF38,IF(CL=5,VL用!DA38,IF(CL=6,VL用!DV38,IF(CL=7,VL用!EQ38,IF(CL=8,VL用!FL38,IF(CL=9,VL用!GG38,VL用!HB38)))))))))","v":4},{"$f":"IF(CL=1,VL用!V38,IF(CL=2,VL用!AQ38,IF(CL=3,VL用!BL38,IF(CL=4,VL用!CG38,IF(CL=5,VL用!DB38,IF(CL=6,VL用!DW38,IF(CL=7,VL用!ER38,IF(CL=8,VL用!FM38,IF(CL=9,VL用!GH38,VL用!HC38)))))))))","v":8},{"$f":"IF(CL=1,VL用!W38,IF(CL=2,VL用!AR38,IF(CL=3,VL用!BM38,IF(CL=4,VL用!CH38,IF(CL=5,VL用!DC38,IF(CL=6,VL用!DX38,IF(CL=7,VL用!ES38,IF(CL=8,VL用!FN38,IF(CL=9,VL用!GI38,VL用!HD38)))))))))","v":-5},{"$f":"IF(CL=1,VL用!X38,IF(CL=2,VL用!AS38,IF(CL=3,VL用!BN38,IF(CL=4,VL用!CI38,IF(CL=5,VL用!DD38,IF(CL=6,VL用!DY38,IF(CL=7,VL用!ET38,IF(CL=8,VL用!FO38,IF(CL=9,VL用!GJ38,VL用!HE38)))))))))","v":0},{"$f":"IF(CL=1,VL用!Y38,IF(CL=2,VL用!AT38,IF(CL=3,VL用!BO38,IF(CL=4,VL用!CJ38,IF(CL=5,VL用!DE38,IF(CL=6,VL用!DZ38,IF(CL=7,VL用!EU38,IF(CL=8,VL用!FP38,IF(CL=9,VL用!GK38,VL用!HF38)))))))))","v":-20},{"$f":"IF(CL=1,VL用!Z38,IF(CL=2,VL用!AU38,IF(CL=3,VL用!BP38,IF(CL=4,VL用!CK38,IF(CL=5,VL用!DF38,IF(CL=6,VL用!EA38,IF(CL=7,VL用!EV38,IF(CL=8,VL用!FQ38,IF(CL=9,VL用!GL38,VL用!HG38)))))))))","v":20},"死神の鎌",null,null,"★","自","ｻﾌﾞ","自","なし","自動","4BP",3,"35Cの間、武器を「死神の鎌」に変更。"]
[null,"神格",{"$f":"VL用!B13+CL","v":8},{"$f":"VL用!C13+CL","v":9},{"$f":"VL用!D13+CL","v":7},{"$f":"VL用!E13+CL","v":14},{"$f":"VL用!F13+CL","v":7},"攻撃でﾀﾞﾒｰｼﾞを受けた時、与えた対象に「BS：怯み(1)」付与。",null,null,null,null,null,null,null,null,null,null,{"$f":"IF(CL=1,VL用!G39,IF(CL=2,VL用!AB39,IF(CL=3,VL用!AW39,IF(CL=4,VL用!BR39,IF(CL=5,VL用!CM39,IF(CL=6,VL用!DH39,IF(CL=7,VL用!EC39,IF(CL=8,VL用!EX39,IF(CL=9,VL用!FS39,VL用!GN39)))))))))","v":4},{"$f":"IF(CL=1,VL用!H39,IF(CL=2,VL用!AC39,IF(CL=3,VL用!AX39,IF(CL=4,VL用!BS39,IF(CL=5,VL用!CN39,IF(CL=6,VL用!DI39,IF(CL=7,VL用!ED39,IF(CL=8,VL用!EY39,IF(CL=9,VL用!FT39,VL用!GO39)))))))))","v":4},{"$f":"IF(CL=1,VL用!I39,IF(CL=2,VL用!AD39,IF(CL=3,VL用!AY39,IF(CL=4,VL用!BT39,IF(CL=5,VL用!CO39,IF(CL=6,VL用!DJ39,IF(CL=7,VL用!EE39,IF(CL=8,VL用!EZ39,IF(CL=9,VL用!FU39,VL用!GP39)))))))))","v":3},{"$f":"IF(CL=1,VL用!J39,IF(CL=2,VL用!AE39,IF(CL=3,VL用!AZ39,IF(CL=4,VL用!BU39,IF(CL=5,VL用!CP39,IF(CL=6,VL用!DK39,IF(CL=7,VL用!EF39,IF(CL=8,VL用!FA39,IF(CL=9,VL用!FV39,VL用!GQ39)))))))))","v":4},{"$f":"IF(CL=1,VL用!K39,IF(CL=2,VL用!AF39,IF(CL=3,VL用!BA39,IF(CL=4,VL用!BV39,IF(CL=5,VL用!CQ39,IF(CL=6,VL用!DL39,IF(CL=7,VL用!EG39,IF(CL=8,VL用!FB39,IF(CL=9,VL用!FW39,VL用!GR39)))))))))","v":5},{"$f":"IF(CL=1,VL用!L39,IF(CL=2,VL用!AG39,IF(CL=3,VL用!BB39,IF(CL=4,VL用!BW39,IF(CL=5,VL用!CR39,IF(CL=6,VL用!DM39,IF(CL=7,VL用!EH39,IF(CL=8,VL用!FC39,IF(CL=9,VL用!FX39,VL用!GS39)))))))))","v":2},{"$f":"IF(CL=1,VL用!M39,IF(CL=2,VL用!AH39,IF(CL=3,VL用!BC39,IF(CL=4,VL用!BX39,IF(CL=5,VL用!CS39,IF(CL=6,VL用!DN39,IF(CL=7,VL用!EI39,IF(CL=8,VL用!FD39,IF(CL=9,VL用!FY39,VL用!GT39)))))))))","v":7},{"$f":"IF(CL=1,VL用!N39,IF(CL=2,VL用!AI39,IF(CL=3,VL用!BD39,IF(CL=4,VL用!BY39,IF(CL=5,VL用!CT39,IF(CL=6,VL用!DO39,IF(CL=7,VL用!EJ39,IF(CL=8,VL用!FE39,IF(CL=9,VL用!FZ39,VL用!GU39)))))))))","v":8},{"$f":"IF(CL=1,VL用!O39,IF(CL=2,VL用!AJ39,IF(CL=3,VL用!BE39,IF(CL=4,VL用!BZ39,IF(CL=5,VL用!CU39,IF(CL=6,VL用!DP39,IF(CL=7,VL用!EK39,IF(CL=8,VL用!FF39,IF(CL=9,VL用!GA39,VL用!GV39)))))))))","v":108},{"$f":"IF(CL=1,VL用!P39,IF(CL=2,VL用!AK39,IF(CL=3,VL用!BF39,IF(CL=4,VL用!CA39,IF(CL=5,VL用!CV39,IF(CL=6,VL用!DQ39,IF(CL=7,VL用!EL39,IF(CL=8,VL用!FG39,IF(CL=9,VL用!GB39,VL用!GW39)))))))))","v":28},{"$f":"IF(CL=1,VL用!Q39,IF(CL=2,VL用!AL39,IF(CL=3,VL用!BG39,IF(CL=4,VL用!CB39,IF(CL=5,VL用!CW39,IF(CL=6,VL用!DR39,IF(CL=7,VL用!EM39,IF(CL=8,VL用!FH39,IF(CL=9,VL用!GC39,VL用!GX39)))))))))","v":8},{"$f":"IF(CL=1,VL用!R39,IF(CL=2,VL用!AM39,IF(CL=3,VL用!BH39,IF(CL=4,VL用!CC39,IF(CL=5,VL用!CX39,IF(CL=6,VL用!DS39,IF(CL=7,VL用!EN39,IF(CL=8,VL用!FI39,IF(CL=9,VL用!GD39,VL用!GY39)))))))))","v":8},{"$f":"IF(CL=1,VL用!S39,IF(CL=2,VL用!AN39,IF(CL=3,VL用!BI39,IF(CL=4,VL用!CD39,IF(CL=5,VL用!CY39,IF(CL=6,VL用!DT39,IF(CL=7,VL用!EO39,IF(CL=8,VL用!FJ39,IF(CL=9,VL用!GE39,VL用!GZ39)))))))))","v":1},{"$f":"IF(CL=1,VL用!T39,IF(CL=2,VL用!AO39,IF(CL=3,VL用!BJ39,IF(CL=4,VL用!CE39,IF(CL=5,VL用!CZ39,IF(CL=6,VL用!DU39,IF(CL=7,VL用!EP39,IF(CL=8,VL用!FK39,IF(CL=9,VL用!GF39,VL用!HA39)))))))))","v":2},{"$f":"IF(CL=1,VL用!U39,IF(CL=2,VL用!AP39,IF(CL=3,VL用!BK39,IF(CL=4,VL用!CF39,IF(CL=5,VL用!DA39,IF(CL=6,VL用!DV39,IF(CL=7,VL用!EQ39,IF(CL=8,VL用!FL39,IF(CL=9,VL用!GG39,VL用!HB39)))))))))","v":3},{"$f":"IF(CL=1,VL用!V39,IF(CL=2,VL用!AQ39,IF(CL=3,VL用!BL39,IF(CL=4,VL用!CG39,IF(CL=5,VL用!DB39,IF(CL=6,VL用!DW39,IF(CL=7,VL用!ER39,IF(CL=8,VL用!FM39,IF(CL=9,VL用!GH39,VL用!HC39)))))))))","v":3},{"$f":"IF(CL=1,VL用!W39,IF(CL=2,VL用!AR39,IF(CL=3,VL用!BM39,IF(CL=4,VL用!CH39,IF(CL=5,VL用!DC39,IF(CL=6,VL用!DX39,IF(CL=7,VL用!ES39,IF(CL=8,VL用!FN39,IF(CL=9,VL用!GI39,VL用!HD39)))))))))","v":2},{"$f":"IF(CL=1,VL用!X39,IF(CL=2,VL用!AS39,IF(CL=3,VL用!BN39,IF(CL=4,VL用!CI39,IF(CL=5,VL用!DD39,IF(CL=6,VL用!DY39,IF(CL=7,VL用!ET39,IF(CL=8,VL用!FO39,IF(CL=9,VL用!GJ39,VL用!HE39)))))))))","v":2},{"$f":"IF(CL=1,VL用!Y39,IF(CL=2,VL用!AT39,IF(CL=3,VL用!BO39,IF(CL=4,VL用!CJ39,IF(CL=5,VL用!DE39,IF(CL=6,VL用!DZ39,IF(CL=7,VL用!EU39,IF(CL=8,VL用!FP39,IF(CL=9,VL用!GK39,VL用!HF39)))))))))","v":0},{"$f":"IF(CL=1,VL用!Z39,IF(CL=2,VL用!AU39,IF(CL=3,VL用!BP39,IF(CL=4,VL用!CK39,IF(CL=5,VL用!DF39,IF(CL=6,VL用!EA39,IF(CL=7,VL用!EV39,IF(CL=8,VL用!FQ39,IF(CL=9,VL用!GL39,VL用!HG39)))))))))","v":0},"Paranormal Power",null,null,"★","自","ｽﾀｰﾄ","自","なし","自動","1BP",1,{"$f":"\"①全達成値+1 ②ﾀﾞﾒｰｼﾞ+\"&CS!T12+5&\" ③C値-1 のどれかを戦闘中適用。\"","v":"①全達成値+1 ②ﾀﾞﾒｰｼﾞ+5 ③C値-1 のどれかを戦闘中適用。"}]
[null,"妖怪",{"$f":"VL用!B14+CL","v":11},{"$f":"VL用!C14+CL","v":5},{"$f":"VL用!D14+CL","v":9},{"$f":"VL用!E14+CL","v":7},{"$f":"VL用!F14+CL","v":13},"判定の1,2の目1つを3にする。感情の強度の合計値-1。",null,null,null,null,null,null,null,null,null,null,{"$f":"IF(CL=1,VL用!G40,IF(CL=2,VL用!AB40,IF(CL=3,VL用!AW40,IF(CL=4,VL用!BR40,IF(CL=5,VL用!CM40,IF(CL=6,VL用!DH40,IF(CL=7,VL用!EC40,IF(CL=8,VL用!EX40,IF(CL=9,VL用!FS40,VL用!GN40)))))))))","v":4},{"$f":"IF(CL=1,VL用!H40,IF(CL=2,VL用!AC40,IF(CL=3,VL用!AX40,IF(CL=4,VL用!BS40,IF(CL=5,VL用!CN40,IF(CL=6,VL用!DI40,IF(CL=7,VL用!ED40,IF(CL=8,VL用!EY40,IF(CL=9,VL用!FT40,VL用!GO40)))))))))","v":4},{"$f":"IF(CL=1,VL用!I40,IF(CL=2,VL用!AD40,IF(CL=3,VL用!AY40,IF(CL=4,VL用!BT40,IF(CL=5,VL用!CO40,IF(CL=6,VL用!DJ40,IF(CL=7,VL用!EE40,IF(CL=8,VL用!EZ40,IF(CL=9,VL用!FU40,VL用!GP40)))))))))","v":3},{"$f":"IF(CL=1,VL用!J40,IF(CL=2,VL用!AE40,IF(CL=3,VL用!AZ40,IF(CL=4,VL用!BU40,IF(CL=5,VL用!CP40,IF(CL=6,VL用!DK40,IF(CL=7,VL用!EF40,IF(CL=8,VL用!FA40,IF(CL=9,VL用!FV40,VL用!GQ40)))))))))","v":4},{"$f":"IF(CL=1,VL用!K40,IF(CL=2,VL用!AF40,IF(CL=3,VL用!BA40,IF(CL=4,VL用!BV40,IF(CL=5,VL用!CQ40,IF(CL=6,VL用!DL40,IF(CL=7,VL用!EG40,IF(CL=8,VL用!FB40,IF(CL=9,VL用!FW40,VL用!GR40)))))))))","v":6},{"$f":"IF(CL=1,VL用!L40,IF(CL=2,VL用!AG40,IF(CL=3,VL用!BB40,IF(CL=4,VL用!BW40,IF(CL=5,VL用!CR40,IF(CL=6,VL用!DM40,IF(CL=7,VL用!EH40,IF(CL=8,VL用!FC40,IF(CL=9,VL用!FX40,VL用!GS40)))))))))","v":3},{"$f":"IF(CL=1,VL用!M40,IF(CL=2,VL用!AH40,IF(CL=3,VL用!BC40,IF(CL=4,VL用!BX40,IF(CL=5,VL用!CS40,IF(CL=6,VL用!DN40,IF(CL=7,VL用!EI40,IF(CL=8,VL用!FD40,IF(CL=9,VL用!FY40,VL用!GT40)))))))))","v":12},{"$f":"IF(CL=1,VL用!N40,IF(CL=2,VL用!AI40,IF(CL=3,VL用!BD40,IF(CL=4,VL用!BY40,IF(CL=5,VL用!CT40,IF(CL=6,VL用!DO40,IF(CL=7,VL用!EJ40,IF(CL=8,VL用!FE40,IF(CL=9,VL用!FZ40,VL用!GU40)))))))))","v":10},{"$f":"IF(CL=1,VL用!O40,IF(CL=2,VL用!AJ40,IF(CL=3,VL用!BE40,IF(CL=4,VL用!BZ40,IF(CL=5,VL用!CU40,IF(CL=6,VL用!DP40,IF(CL=7,VL用!EK40,IF(CL=8,VL用!FF40,IF(CL=9,VL用!GA40,VL用!GV40)))))))))","v":112},{"$f":"IF(CL=1,VL用!P40,IF(CL=2,VL用!AK40,IF(CL=3,VL用!BF40,IF(CL=4,VL用!CA40,IF(CL=5,VL用!CV40,IF(CL=6,VL用!DQ40,IF(CL=7,VL用!EL40,IF(CL=8,VL用!FG40,IF(CL=9,VL用!GB40,VL用!GW40)))))))))","v":27},{"$f":"IF(CL=1,VL用!Q40,IF(CL=2,VL用!AL40,IF(CL=3,VL用!BG40,IF(CL=4,VL用!CB40,IF(CL=5,VL用!CW40,IF(CL=6,VL用!DR40,IF(CL=7,VL用!EM40,IF(CL=8,VL用!FH40,IF(CL=9,VL用!GC40,VL用!GX40)))))))))","v":7},{"$f":"IF(CL=1,VL用!R40,IF(CL=2,VL用!AM40,IF(CL=3,VL用!BH40,IF(CL=4,VL用!CC40,IF(CL=5,VL用!CX40,IF(CL=6,VL用!DS40,IF(CL=7,VL用!EN40,IF(CL=8,VL用!FI40,IF(CL=9,VL用!GD40,VL用!GY40)))))))))","v":7},{"$f":"IF(CL=1,VL用!S40,IF(CL=2,VL用!AN40,IF(CL=3,VL用!BI40,IF(CL=4,VL用!CD40,IF(CL=5,VL用!CY40,IF(CL=6,VL用!DT40,IF(CL=7,VL用!EO40,IF(CL=8,VL用!FJ40,IF(CL=9,VL用!GE40,VL用!GZ40)))))))))","v":0},{"$f":"IF(CL=1,VL用!T40,IF(CL=2,VL用!AO40,IF(CL=3,VL用!BJ40,IF(CL=4,VL用!CE40,IF(CL=5,VL用!CZ40,IF(CL=6,VL用!DU40,IF(CL=7,VL用!EP40,IF(CL=8,VL用!FK40,IF(CL=9,VL用!GF40,VL用!HA40)))))))))","v":0},{"$f":"IF(CL=1,VL用!U40,IF(CL=2,VL用!AP40,IF(CL=3,VL用!BK40,IF(CL=4,VL用!CF40,IF(CL=5,VL用!DA40,IF(CL=6,VL用!DV40,IF(CL=7,VL用!EQ40,IF(CL=8,VL用!FL40,IF(CL=9,VL用!GG40,VL用!HB40)))))))))","v":1},{"$f":"IF(CL=1,VL用!V40,IF(CL=2,VL用!AQ40,IF(CL=3,VL用!BL40,IF(CL=4,VL用!CG40,IF(CL=5,VL用!DB40,IF(CL=6,VL用!DW40,IF(CL=7,VL用!ER40,IF(CL=8,VL用!FM40,IF(CL=9,VL用!GH40,VL用!HC40)))))))))","v":1},{"$f":"IF(CL=1,VL用!W40,IF(CL=2,VL用!AR40,IF(CL=3,VL用!BM40,IF(CL=4,VL用!CH40,IF(CL=5,VL用!DC40,IF(CL=6,VL用!DX40,IF(CL=7,VL用!ES40,IF(CL=8,VL用!FN40,IF(CL=9,VL用!GI40,VL用!HD40)))))))))","v":2},{"$f":"IF(CL=1,VL用!X40,IF(CL=2,VL用!AS40,IF(CL=3,VL用!BN40,IF(CL=4,VL用!CI40,IF(CL=5,VL用!DD40,IF(CL=6,VL用!DY40,IF(CL=7,VL用!ET40,IF(CL=8,VL用!FO40,IF(CL=9,VL用!GJ40,VL用!HE40)))))))))","v":-3},{"$f":"IF(CL=1,VL用!Y40,IF(CL=2,VL用!AT40,IF(CL=3,VL用!BO40,IF(CL=4,VL用!CJ40,IF(CL=5,VL用!DE40,IF(CL=6,VL用!DZ40,IF(CL=7,VL用!EU40,IF(CL=8,VL用!FP40,IF(CL=9,VL用!GK40,VL用!HF40)))))))))","v":-5},{"$f":"IF(CL=1,VL用!Z40,IF(CL=2,VL用!AU40,IF(CL=3,VL用!BP40,IF(CL=4,VL用!CK40,IF(CL=5,VL用!DF40,IF(CL=6,VL用!EA40,IF(CL=7,VL用!EV40,IF(CL=8,VL用!FQ40,IF(CL=9,VL用!GL40,VL用!HG40)))))))))","v":-5},"妖力波",null,null,"★","自","ｵｰﾄ","単","0-4","自動","2BP",3,"出目17以下の判定の低い方の出目を1にする。その後振り直しなど不可。"]
[null,"花姫",{"$f":"VL用!B15+CL","v":6},{"$f":"VL用!C15+CL","v":13},{"$f":"VL用!D15+CL","v":6},{"$f":"VL用!E15+CL","v":14},{"$f":"VL用!F15+CL","v":6},{"$f":"\"攻撃に「BS：花毒(\"&CS!T12+5&\")」付与。 & ｸﾗｽｽｷﾙのSL上限に+1\"","v":"攻撃に「BS：花毒(5)」付与。 & ｸﾗｽｽｷﾙのSL上限に+1"},null,null,null,null,null,null,null,null,null,null,{"$f":"IF(CL=1,VL用!G41,IF(CL=2,VL用!AB41,IF(CL=3,VL用!AW41,IF(CL=4,VL用!BR41,IF(CL=5,VL用!CM41,IF(CL=6,VL用!DH41,IF(CL=7,VL用!EC41,IF(CL=8,VL用!EX41,IF(CL=9,VL用!FS41,VL用!GN41)))))))))","v":4},{"$f":"IF(CL=1,VL用!H41,IF(CL=2,VL用!AC41,IF(CL=3,VL用!AX41,IF(CL=4,VL用!BS41,IF(CL=5,VL用!CN41,IF(CL=6,VL用!DI41,IF(CL=7,VL用!ED41,IF(CL=8,VL用!EY41,IF(CL=9,VL用!FT41,VL用!GO41)))))))))","v":4},{"$f":"IF(CL=1,VL用!I41,IF(CL=2,VL用!AD41,IF(CL=3,VL用!AY41,IF(CL=4,VL用!BT41,IF(CL=5,VL用!CO41,IF(CL=6,VL用!DJ41,IF(CL=7,VL用!EE41,IF(CL=8,VL用!EZ41,IF(CL=9,VL用!FU41,VL用!GP41)))))))))","v":4},{"$f":"IF(CL=1,VL用!J41,IF(CL=2,VL用!AE41,IF(CL=3,VL用!AZ41,IF(CL=4,VL用!BU41,IF(CL=5,VL用!CP41,IF(CL=6,VL用!DK41,IF(CL=7,VL用!EF41,IF(CL=8,VL用!FA41,IF(CL=9,VL用!FV41,VL用!GQ41)))))))))","v":4},{"$f":"IF(CL=1,VL用!K41,IF(CL=2,VL用!AF41,IF(CL=3,VL用!BA41,IF(CL=4,VL用!BV41,IF(CL=5,VL用!CQ41,IF(CL=6,VL用!DL41,IF(CL=7,VL用!EG41,IF(CL=8,VL用!FB41,IF(CL=9,VL用!FW41,VL用!GR41)))))))))","v":4},{"$f":"IF(CL=1,VL用!L41,IF(CL=2,VL用!AG41,IF(CL=3,VL用!BB41,IF(CL=4,VL用!BW41,IF(CL=5,VL用!CR41,IF(CL=6,VL用!DM41,IF(CL=7,VL用!EH41,IF(CL=8,VL用!FC41,IF(CL=9,VL用!FX41,VL用!GS41)))))))))","v":5},{"$f":"IF(CL=1,VL用!M41,IF(CL=2,VL用!AH41,IF(CL=3,VL用!BC41,IF(CL=4,VL用!BX41,IF(CL=5,VL用!CS41,IF(CL=6,VL用!DN41,IF(CL=7,VL用!EI41,IF(CL=8,VL用!FD41,IF(CL=9,VL用!FY41,VL用!GT41)))))))))","v":8},{"$f":"IF(CL=1,VL用!N41,IF(CL=2,VL用!AI41,IF(CL=3,VL用!BD41,IF(CL=4,VL用!BY41,IF(CL=5,VL用!CT41,IF(CL=6,VL用!DO41,IF(CL=7,VL用!EJ41,IF(CL=8,VL用!FE41,IF(CL=9,VL用!FZ41,VL用!GU41)))))))))","v":8},{"$f":"IF(CL=1,VL用!O41,IF(CL=2,VL用!AJ41,IF(CL=3,VL用!BE41,IF(CL=4,VL用!BZ41,IF(CL=5,VL用!CU41,IF(CL=6,VL用!DP41,IF(CL=7,VL用!EK41,IF(CL=8,VL用!FF41,IF(CL=9,VL用!GA41,VL用!GV41)))))))))","v":75},{"$f":"IF(CL=1,VL用!P41,IF(CL=2,VL用!AK41,IF(CL=3,VL用!BF41,IF(CL=4,VL用!CA41,IF(CL=5,VL用!CV41,IF(CL=6,VL用!DQ41,IF(CL=7,VL用!EL41,IF(CL=8,VL用!FG41,IF(CL=9,VL用!GB41,VL用!GW41)))))))))","v":35},{"$f":"IF(CL=1,VL用!Q41,IF(CL=2,VL用!AL41,IF(CL=3,VL用!BG41,IF(CL=4,VL用!CB41,IF(CL=5,VL用!CW41,IF(CL=6,VL用!DR41,IF(CL=7,VL用!EM41,IF(CL=8,VL用!FH41,IF(CL=9,VL用!GC41,VL用!GX41)))))))))","v":3},{"$f":"IF(CL=1,VL用!R41,IF(CL=2,VL用!AM41,IF(CL=3,VL用!BH41,IF(CL=4,VL用!CC41,IF(CL=5,VL用!CX41,IF(CL=6,VL用!DS41,IF(CL=7,VL用!EN41,IF(CL=8,VL用!FI41,IF(CL=9,VL用!GD41,VL用!GY41)))))))))","v":15},{"$f":"IF(CL=1,VL用!S41,IF(CL=2,VL用!AN41,IF(CL=3,VL用!BI41,IF(CL=4,VL用!CD41,IF(CL=5,VL用!CY41,IF(CL=6,VL用!DT41,IF(CL=7,VL用!EO41,IF(CL=8,VL用!FJ41,IF(CL=9,VL用!GE41,VL用!GZ41)))))))))","v":-28},{"$f":"IF(CL=1,VL用!T41,IF(CL=2,VL用!AO41,IF(CL=3,VL用!BJ41,IF(CL=4,VL用!CE41,IF(CL=5,VL用!CZ41,IF(CL=6,VL用!DU41,IF(CL=7,VL用!EP41,IF(CL=8,VL用!FK41,IF(CL=9,VL用!GF41,VL用!HA41)))))))))","v":-3},{"$f":"IF(CL=1,VL用!U41,IF(CL=2,VL用!AP41,IF(CL=3,VL用!BK41,IF(CL=4,VL用!CF41,IF(CL=5,VL用!DA41,IF(CL=6,VL用!DV41,IF(CL=7,VL用!EQ41,IF(CL=8,VL用!FL41,IF(CL=9,VL用!GG41,VL用!HB41)))))))))","v":10},{"$f":"IF(CL=1,VL用!V41,IF(CL=2,VL用!AQ41,IF(CL=3,VL用!BL41,IF(CL=4,VL用!CG41,IF(CL=5,VL用!DB41,IF(CL=6,VL用!DW41,IF(CL=7,VL用!ER41,IF(CL=8,VL用!FM41,IF(CL=9,VL用!GH41,VL用!HC41)))))))))","v":0},{"$f":"IF(CL=1,VL用!W41,IF(CL=2,VL用!AR41,IF(CL=3,VL用!BM41,IF(CL=4,VL用!CH41,IF(CL=5,VL用!DC41,IF(CL=6,VL用!DX41,IF(CL=7,VL用!ES41,IF(CL=8,VL用!FN41,IF(CL=9,VL用!GI41,VL用!HD41)))))))))","v":5},{"$f":"IF(CL=1,VL用!X41,IF(CL=2,VL用!AS41,IF(CL=3,VL用!BN41,IF(CL=4,VL用!CI41,IF(CL=5,VL用!DD41,IF(CL=6,VL用!DY41,IF(CL=7,VL用!ET41,IF(CL=8,VL用!FO41,IF(CL=9,VL用!GJ41,VL用!HE41)))))))))","v":10},{"$f":"IF(CL=1,VL用!Y41,IF(CL=2,VL用!AT41,IF(CL=3,VL用!BO41,IF(CL=4,VL用!CJ41,IF(CL=5,VL用!DE41,IF(CL=6,VL用!DZ41,IF(CL=7,VL用!EU41,IF(CL=8,VL用!FP41,IF(CL=9,VL用!GK41,VL用!HF41)))))))))","v":25},{"$f":"IF(CL=1,VL用!Z41,IF(CL=2,VL用!AU41,IF(CL=3,VL用!BP41,IF(CL=4,VL用!CK41,IF(CL=5,VL用!DF41,IF(CL=6,VL用!EA41,IF(CL=7,VL用!EV41,IF(CL=8,VL用!FQ41,IF(CL=9,VL用!GL41,VL用!HG41)))))))))","v":-10},"フルブルーム",null,null,"★","自","ｵｰﾄ","自","なし","自動","2BP",0,{"$f":"\"C開始時使用。HP\"&CS!T12*15+90&\"回復。以後ｻﾌﾞｱｸｼｮﾝｽｷﾙでﾌﾗﾜｰC1つ獲得。\"","v":"C開始時使用。HP90回復。以後ｻﾌﾞｱｸｼｮﾝｽｷﾙでﾌﾗﾜｰC1つ獲得。"}]
[null,"虫人",{"$f":"VL用!B16+CL","v":12},{"$f":"VL用!C16+CL","v":6},{"$f":"VL用!D16+CL","v":12},{"$f":"VL用!E16+CL","v":7},{"$f":"VL用!F16+CL","v":8},"DでHP0になる場合、HPを1にする。1/Sce & 「BS：花毒」を60%で無効 ",null,null,null,null,null,null,null,null,null,null,{"$f":"IF(CL=1,VL用!G42,IF(CL=2,VL用!AB42,IF(CL=3,VL用!AW42,IF(CL=4,VL用!BR42,IF(CL=5,VL用!CM42,IF(CL=6,VL用!DH42,IF(CL=7,VL用!EC42,IF(CL=8,VL用!EX42,IF(CL=9,VL用!FS42,VL用!GN42)))))))))","v":5},{"$f":"IF(CL=1,VL用!H42,IF(CL=2,VL用!AC42,IF(CL=3,VL用!AX42,IF(CL=4,VL用!BS42,IF(CL=5,VL用!CN42,IF(CL=6,VL用!DI42,IF(CL=7,VL用!ED42,IF(CL=8,VL用!EY42,IF(CL=9,VL用!FT42,VL用!GO42)))))))))","v":4},{"$f":"IF(CL=1,VL用!I42,IF(CL=2,VL用!AD42,IF(CL=3,VL用!AY42,IF(CL=4,VL用!BT42,IF(CL=5,VL用!CO42,IF(CL=6,VL用!DJ42,IF(CL=7,VL用!EE42,IF(CL=8,VL用!EZ42,IF(CL=9,VL用!FU42,VL用!GP42)))))))))","v":5},{"$f":"IF(CL=1,VL用!J42,IF(CL=2,VL用!AE42,IF(CL=3,VL用!AZ42,IF(CL=4,VL用!BU42,IF(CL=5,VL用!CP42,IF(CL=6,VL用!DK42,IF(CL=7,VL用!EF42,IF(CL=8,VL用!FA42,IF(CL=9,VL用!FV42,VL用!GQ42)))))))))","v":3},{"$f":"IF(CL=1,VL用!K42,IF(CL=2,VL用!AF42,IF(CL=3,VL用!BA42,IF(CL=4,VL用!BV42,IF(CL=5,VL用!CQ42,IF(CL=6,VL用!DL42,IF(CL=7,VL用!EG42,IF(CL=8,VL用!FB42,IF(CL=9,VL用!FW42,VL用!GR42)))))))))","v":2},{"$f":"IF(CL=1,VL用!L42,IF(CL=2,VL用!AG42,IF(CL=3,VL用!BB42,IF(CL=4,VL用!BW42,IF(CL=5,VL用!CR42,IF(CL=6,VL用!DM42,IF(CL=7,VL用!EH42,IF(CL=8,VL用!FC42,IF(CL=9,VL用!FX42,VL用!GS42)))))))))","v":3},{"$f":"IF(CL=1,VL用!M42,IF(CL=2,VL用!AH42,IF(CL=3,VL用!BC42,IF(CL=4,VL用!BX42,IF(CL=5,VL用!CS42,IF(CL=6,VL用!DN42,IF(CL=7,VL用!EI42,IF(CL=8,VL用!FD42,IF(CL=9,VL用!FY42,VL用!GT42)))))))))","v":11},{"$f":"IF(CL=1,VL用!N42,IF(CL=2,VL用!AI42,IF(CL=3,VL用!BD42,IF(CL=4,VL用!BY42,IF(CL=5,VL用!CT42,IF(CL=6,VL用!DO42,IF(CL=7,VL用!EJ42,IF(CL=8,VL用!FE42,IF(CL=9,VL用!FZ42,VL用!GU42)))))))))","v":7},{"$f":"IF(CL=1,VL用!O42,IF(CL=2,VL用!AJ42,IF(CL=3,VL用!BE42,IF(CL=4,VL用!BZ42,IF(CL=5,VL用!CU42,IF(CL=6,VL用!DP42,IF(CL=7,VL用!EK42,IF(CL=8,VL用!FF42,IF(CL=9,VL用!GA42,VL用!GV42)))))))))","v":105},{"$f":"IF(CL=1,VL用!P42,IF(CL=2,VL用!AK42,IF(CL=3,VL用!BF42,IF(CL=4,VL用!CA42,IF(CL=5,VL用!CV42,IF(CL=6,VL用!DQ42,IF(CL=7,VL用!EL42,IF(CL=8,VL用!FG42,IF(CL=9,VL用!GB42,VL用!GW42)))))))))","v":23},{"$f":"IF(CL=1,VL用!Q42,IF(CL=2,VL用!AL42,IF(CL=3,VL用!BG42,IF(CL=4,VL用!CB42,IF(CL=5,VL用!CW42,IF(CL=6,VL用!DR42,IF(CL=7,VL用!EM42,IF(CL=8,VL用!FH42,IF(CL=9,VL用!GC42,VL用!GX42)))))))))","v":14},{"$f":"IF(CL=1,VL用!R42,IF(CL=2,VL用!AM42,IF(CL=3,VL用!BH42,IF(CL=4,VL用!CC42,IF(CL=5,VL用!CX42,IF(CL=6,VL用!DS42,IF(CL=7,VL用!EN42,IF(CL=8,VL用!FI42,IF(CL=9,VL用!GD42,VL用!GY42)))))))))","v":14},{"$f":"IF(CL=1,VL用!S42,IF(CL=2,VL用!AN42,IF(CL=3,VL用!BI42,IF(CL=4,VL用!CD42,IF(CL=5,VL用!CY42,IF(CL=6,VL用!DT42,IF(CL=7,VL用!EO42,IF(CL=8,VL用!FJ42,IF(CL=9,VL用!GE42,VL用!GZ42)))))))))","v":-10},{"$f":"IF(CL=1,VL用!T42,IF(CL=2,VL用!AO42,IF(CL=3,VL用!BJ42,IF(CL=4,VL用!CE42,IF(CL=5,VL用!CZ42,IF(CL=6,VL用!DU42,IF(CL=7,VL用!EP42,IF(CL=8,VL用!FK42,IF(CL=9,VL用!GF42,VL用!HA42)))))))))","v":2},{"$f":"IF(CL=1,VL用!U42,IF(CL=2,VL用!AP42,IF(CL=3,VL用!BK42,IF(CL=4,VL用!CF42,IF(CL=5,VL用!DA42,IF(CL=6,VL用!DV42,IF(CL=7,VL用!EQ42,IF(CL=8,VL用!FL42,IF(CL=9,VL用!GG42,VL用!HB42)))))))))","v":5},{"$f":"IF(CL=1,VL用!V42,IF(CL=2,VL用!AQ42,IF(CL=3,VL用!BL42,IF(CL=4,VL用!CG42,IF(CL=5,VL用!DB42,IF(CL=6,VL用!DW42,IF(CL=7,VL用!ER42,IF(CL=8,VL用!FM42,IF(CL=9,VL用!GH42,VL用!HC42)))))))))","v":-3},{"$f":"IF(CL=1,VL用!W42,IF(CL=2,VL用!AR42,IF(CL=3,VL用!BM42,IF(CL=4,VL用!CH42,IF(CL=5,VL用!DC42,IF(CL=6,VL用!DX42,IF(CL=7,VL用!ES42,IF(CL=8,VL用!FN42,IF(CL=9,VL用!GI42,VL用!HD42)))))))))","v":-10},{"$f":"IF(CL=1,VL用!X42,IF(CL=2,VL用!AS42,IF(CL=3,VL用!BN42,IF(CL=4,VL用!CI42,IF(CL=5,VL用!DD42,IF(CL=6,VL用!DY42,IF(CL=7,VL用!ET42,IF(CL=8,VL用!FO42,IF(CL=9,VL用!GJ42,VL用!HE42)))))))))","v":-11},{"$f":"IF(CL=1,VL用!Y42,IF(CL=2,VL用!AT42,IF(CL=3,VL用!BO42,IF(CL=4,VL用!CJ42,IF(CL=5,VL用!DE42,IF(CL=6,VL用!DZ42,IF(CL=7,VL用!EU42,IF(CL=8,VL用!FP42,IF(CL=9,VL用!GK42,VL用!HF42)))))))))","v":6},{"$f":"IF(CL=1,VL用!Z42,IF(CL=2,VL用!AU42,IF(CL=3,VL用!BP42,IF(CL=4,VL用!CK42,IF(CL=5,VL用!DF42,IF(CL=6,VL用!EA42,IF(CL=7,VL用!EV42,IF(CL=8,VL用!FQ42,IF(CL=9,VL用!GL42,VL用!HG42)))))))))","v":6},"タクタイルムーブ",null,null,"★","自","ｵｰﾄ","自","なし","自動","2BP",0,{"$f":"\"回避判定直前使用。達成値+\"&(3+ROUNDUP(CS!T12/3,0))&\"。回避成功の場合,次の命中+\"&(3+ROUNDUP(CS!T12/3,0))","v":"回避判定直前使用。達成値+3。回避成功の場合,次の命中+3"}]
[null,"戦乙女",{"$f":"VL用!B17+CL","v":8},{"$f":"VL用!C17+CL","v":11},{"$f":"VL用!D17+CL","v":9},{"$f":"VL用!E17+CL","v":11},{"$f":"VL用!F17+CL","v":6},"全てのｽｷﾙ代償-1MP。(下限値：3MP) 感情の個数-1",null,null,null,null,null,null,null,null,null,null,{"$f":"IF(CL=1,VL用!G43,IF(CL=2,VL用!AB43,IF(CL=3,VL用!AW43,IF(CL=4,VL用!BR43,IF(CL=5,VL用!CM43,IF(CL=6,VL用!DH43,IF(CL=7,VL用!EC43,IF(CL=8,VL用!EX43,IF(CL=9,VL用!FS43,VL用!GN43)))))))))","v":5},{"$f":"IF(CL=1,VL用!H43,IF(CL=2,VL用!AC43,IF(CL=3,VL用!AX43,IF(CL=4,VL用!BS43,IF(CL=5,VL用!CN43,IF(CL=6,VL用!DI43,IF(CL=7,VL用!ED43,IF(CL=8,VL用!EY43,IF(CL=9,VL用!FT43,VL用!GO43)))))))))","v":3},{"$f":"IF(CL=1,VL用!I43,IF(CL=2,VL用!AD43,IF(CL=3,VL用!AY43,IF(CL=4,VL用!BT43,IF(CL=5,VL用!CO43,IF(CL=6,VL用!DJ43,IF(CL=7,VL用!EE43,IF(CL=8,VL用!EZ43,IF(CL=9,VL用!FU43,VL用!GP43)))))))))","v":3},{"$f":"IF(CL=1,VL用!J43,IF(CL=2,VL用!AE43,IF(CL=3,VL用!AZ43,IF(CL=4,VL用!BU43,IF(CL=5,VL用!CP43,IF(CL=6,VL用!DK43,IF(CL=7,VL用!EF43,IF(CL=8,VL用!FA43,IF(CL=9,VL用!FV43,VL用!GQ43)))))))))","v":4},{"$f":"IF(CL=1,VL用!K43,IF(CL=2,VL用!AF43,IF(CL=3,VL用!BA43,IF(CL=4,VL用!BV43,IF(CL=5,VL用!CQ43,IF(CL=6,VL用!DL43,IF(CL=7,VL用!EG43,IF(CL=8,VL用!FB43,IF(CL=9,VL用!FW43,VL用!GR43)))))))))","v":5},{"$f":"IF(CL=1,VL用!L43,IF(CL=2,VL用!AG43,IF(CL=3,VL用!BB43,IF(CL=4,VL用!BW43,IF(CL=5,VL用!CR43,IF(CL=6,VL用!DM43,IF(CL=7,VL用!EH43,IF(CL=8,VL用!FC43,IF(CL=9,VL用!FX43,VL用!GS43)))))))))","v":5},{"$f":"IF(CL=1,VL用!M43,IF(CL=2,VL用!AH43,IF(CL=3,VL用!BC43,IF(CL=4,VL用!BX43,IF(CL=5,VL用!CS43,IF(CL=6,VL用!DN43,IF(CL=7,VL用!EI43,IF(CL=8,VL用!FD43,IF(CL=9,VL用!FY43,VL用!GT43)))))))))","v":11},{"$f":"IF(CL=1,VL用!N43,IF(CL=2,VL用!AI43,IF(CL=3,VL用!BD43,IF(CL=4,VL用!BY43,IF(CL=5,VL用!CT43,IF(CL=6,VL用!DO43,IF(CL=7,VL用!EJ43,IF(CL=8,VL用!FE43,IF(CL=9,VL用!FZ43,VL用!GU43)))))))))","v":9},{"$f":"IF(CL=1,VL用!O43,IF(CL=2,VL用!AJ43,IF(CL=3,VL用!BE43,IF(CL=4,VL用!BZ43,IF(CL=5,VL用!CU43,IF(CL=6,VL用!DP43,IF(CL=7,VL用!EK43,IF(CL=8,VL用!FF43,IF(CL=9,VL用!GA43,VL用!GV43)))))))))","v":93},{"$f":"IF(CL=1,VL用!P43,IF(CL=2,VL用!AK43,IF(CL=3,VL用!BF43,IF(CL=4,VL用!CA43,IF(CL=5,VL用!CV43,IF(CL=6,VL用!DQ43,IF(CL=7,VL用!EL43,IF(CL=8,VL用!FG43,IF(CL=9,VL用!GB43,VL用!GW43)))))))))","v":32},{"$f":"IF(CL=1,VL用!Q43,IF(CL=2,VL用!AL43,IF(CL=3,VL用!BG43,IF(CL=4,VL用!CB43,IF(CL=5,VL用!CW43,IF(CL=6,VL用!DR43,IF(CL=7,VL用!EM43,IF(CL=8,VL用!FH43,IF(CL=9,VL用!GC43,VL用!GX43)))))))))","v":5},{"$f":"IF(CL=1,VL用!R43,IF(CL=2,VL用!AM43,IF(CL=3,VL用!BH43,IF(CL=4,VL用!CC43,IF(CL=5,VL用!CX43,IF(CL=6,VL用!DS43,IF(CL=7,VL用!EN43,IF(CL=8,VL用!FI43,IF(CL=9,VL用!GD43,VL用!GY43)))))))))","v":4},{"$f":"IF(CL=1,VL用!S43,IF(CL=2,VL用!AN43,IF(CL=3,VL用!BI43,IF(CL=4,VL用!CD43,IF(CL=5,VL用!CY43,IF(CL=6,VL用!DT43,IF(CL=7,VL用!EO43,IF(CL=8,VL用!FJ43,IF(CL=9,VL用!GE43,VL用!GZ43)))))))))","v":5},{"$f":"IF(CL=1,VL用!T43,IF(CL=2,VL用!AO43,IF(CL=3,VL用!BJ43,IF(CL=4,VL用!CE43,IF(CL=5,VL用!CZ43,IF(CL=6,VL用!DU43,IF(CL=7,VL用!EP43,IF(CL=8,VL用!FK43,IF(CL=9,VL用!GF43,VL用!HA43)))))))))","v":0},{"$f":"IF(CL=1,VL用!U43,IF(CL=2,VL用!AP43,IF(CL=3,VL用!BK43,IF(CL=4,VL用!CF43,IF(CL=5,VL用!DA43,IF(CL=6,VL用!DV43,IF(CL=7,VL用!EQ43,IF(CL=8,VL用!FL43,IF(CL=9,VL用!GG43,VL用!HB43)))))))))","v":-6},{"$f":"IF(CL=1,VL用!V43,IF(CL=2,VL用!AQ43,IF(CL=3,VL用!BL43,IF(CL=4,VL用!CG43,IF(CL=5,VL用!DB43,IF(CL=6,VL用!DW43,IF(CL=7,VL用!ER43,IF(CL=8,VL用!FM43,IF(CL=9,VL用!GH43,VL用!HC43)))))))))","v":5},{"$f":"IF(CL=1,VL用!W43,IF(CL=2,VL用!AR43,IF(CL=3,VL用!BM43,IF(CL=4,VL用!CH43,IF(CL=5,VL用!DC43,IF(CL=6,VL用!DX43,IF(CL=7,VL用!ES43,IF(CL=8,VL用!FN43,IF(CL=9,VL用!GI43,VL用!HD43)))))))))","v":3},{"$f":"IF(CL=1,VL用!X43,IF(CL=2,VL用!AS43,IF(CL=3,VL用!BN43,IF(CL=4,VL用!CI43,IF(CL=5,VL用!DD43,IF(CL=6,VL用!DY43,IF(CL=7,VL用!ET43,IF(CL=8,VL用!FO43,IF(CL=9,VL用!GJ43,VL用!HE43)))))))))","v":-5},{"$f":"IF(CL=1,VL用!Y43,IF(CL=2,VL用!AT43,IF(CL=3,VL用!BO43,IF(CL=4,VL用!CJ43,IF(CL=5,VL用!DE43,IF(CL=6,VL用!DZ43,IF(CL=7,VL用!EU43,IF(CL=8,VL用!FP43,IF(CL=9,VL用!GK43,VL用!HF43)))))))))","v":5},{"$f":"IF(CL=1,VL用!Z43,IF(CL=2,VL用!AU43,IF(CL=3,VL用!BP43,IF(CL=4,VL用!CK43,IF(CL=5,VL用!DF43,IF(CL=6,VL用!EA43,IF(CL=7,VL用!EV43,IF(CL=8,VL用!FQ43,IF(CL=9,VL用!GL43,VL用!HG43)))))))))","v":-8},"トゥルーフェイス",null,null,"★","自","ｵｰﾄ","自","なし","自動","4BP",0,{"$f":"\"感情が2つ以下でのみ使用可。全達成値+2 & 与D+\"&(CL*6+20)&\"　1ｾｯｼｮﾝ1回\"","v":"感情が2つ以下でのみ使用可。全達成値+2 & 与D+26　1ｾｯｼｮﾝ1回"}]
[null,"半魚人",{"$f":"VL用!B18+CL","v":8},{"$f":"VL用!C18+CL","v":9},{"$f":"VL用!D18+CL","v":13},{"$f":"VL用!E18+CL","v":9},{"$f":"VL用!F18+CL","v":6},"ﾀﾞﾒｰｼﾞﾛｰﾙで5MP支払って〈水〉に変更できる。 & 全てのｽｷﾙ代償+1MP",null,null,null,null,null,null,null,null,null,null,{"$f":"IF(CL=1,VL用!G44,IF(CL=2,VL用!AB44,IF(CL=3,VL用!AW44,IF(CL=4,VL用!BR44,IF(CL=5,VL用!CM44,IF(CL=6,VL用!DH44,IF(CL=7,VL用!EC44,IF(CL=8,VL用!EX44,IF(CL=9,VL用!FS44,VL用!GN44)))))))))","v":5},{"$f":"IF(CL=1,VL用!H44,IF(CL=2,VL用!AC44,IF(CL=3,VL用!AX44,IF(CL=4,VL用!BS44,IF(CL=5,VL用!CN44,IF(CL=6,VL用!DI44,IF(CL=7,VL用!ED44,IF(CL=8,VL用!EY44,IF(CL=9,VL用!FT44,VL用!GO44)))))))))","v":3},{"$f":"IF(CL=1,VL用!I44,IF(CL=2,VL用!AD44,IF(CL=3,VL用!AY44,IF(CL=4,VL用!BT44,IF(CL=5,VL用!CO44,IF(CL=6,VL用!DJ44,IF(CL=7,VL用!EE44,IF(CL=8,VL用!EZ44,IF(CL=9,VL用!FU44,VL用!GP44)))))))))","v":4},{"$f":"IF(CL=1,VL用!J44,IF(CL=2,VL用!AE44,IF(CL=3,VL用!AZ44,IF(CL=4,VL用!BU44,IF(CL=5,VL用!CP44,IF(CL=6,VL用!DK44,IF(CL=7,VL用!EF44,IF(CL=8,VL用!FA44,IF(CL=9,VL用!FV44,VL用!GQ44)))))))))","v":4},{"$f":"IF(CL=1,VL用!K44,IF(CL=2,VL用!AF44,IF(CL=3,VL用!BA44,IF(CL=4,VL用!BV44,IF(CL=5,VL用!CQ44,IF(CL=6,VL用!DL44,IF(CL=7,VL用!EG44,IF(CL=8,VL用!FB44,IF(CL=9,VL用!FW44,VL用!GR44)))))))))","v":3},{"$f":"IF(CL=1,VL用!L44,IF(CL=2,VL用!AG44,IF(CL=3,VL用!BB44,IF(CL=4,VL用!BW44,IF(CL=5,VL用!CR44,IF(CL=6,VL用!DM44,IF(CL=7,VL用!EH44,IF(CL=8,VL用!FC44,IF(CL=9,VL用!FX44,VL用!GS44)))))))))","v":4},{"$f":"IF(CL=1,VL用!M44,IF(CL=2,VL用!AH44,IF(CL=3,VL用!BC44,IF(CL=4,VL用!BX44,IF(CL=5,VL用!CS44,IF(CL=6,VL用!DN44,IF(CL=7,VL用!EI44,IF(CL=8,VL用!FD44,IF(CL=9,VL用!FY44,VL用!GT44)))))))))","v":8},{"$f":"IF(CL=1,VL用!N44,IF(CL=2,VL用!AI44,IF(CL=3,VL用!BD44,IF(CL=4,VL用!BY44,IF(CL=5,VL用!CT44,IF(CL=6,VL用!DO44,IF(CL=7,VL用!EJ44,IF(CL=8,VL用!FE44,IF(CL=9,VL用!FZ44,VL用!GU44)))))))))","v":7},{"$f":"IF(CL=1,VL用!O44,IF(CL=2,VL用!AJ44,IF(CL=3,VL用!BE44,IF(CL=4,VL用!BZ44,IF(CL=5,VL用!CU44,IF(CL=6,VL用!DP44,IF(CL=7,VL用!EK44,IF(CL=8,VL用!FF44,IF(CL=9,VL用!GA44,VL用!GV44)))))))))","v":85},{"$f":"IF(CL=1,VL用!P44,IF(CL=2,VL用!AK44,IF(CL=3,VL用!BF44,IF(CL=4,VL用!CA44,IF(CL=5,VL用!CV44,IF(CL=6,VL用!DQ44,IF(CL=7,VL用!EL44,IF(CL=8,VL用!FG44,IF(CL=9,VL用!GB44,VL用!GW44)))))))))","v":24},{"$f":"IF(CL=1,VL用!Q44,IF(CL=2,VL用!AL44,IF(CL=3,VL用!BG44,IF(CL=4,VL用!CB44,IF(CL=5,VL用!CW44,IF(CL=6,VL用!DR44,IF(CL=7,VL用!EM44,IF(CL=8,VL用!FH44,IF(CL=9,VL用!GC44,VL用!GX44)))))))))","v":6},{"$f":"IF(CL=1,VL用!R44,IF(CL=2,VL用!AM44,IF(CL=3,VL用!BH44,IF(CL=4,VL用!CC44,IF(CL=5,VL用!CX44,IF(CL=6,VL用!DS44,IF(CL=7,VL用!EN44,IF(CL=8,VL用!FI44,IF(CL=9,VL用!GD44,VL用!GY44)))))))))","v":6},{"$f":"IF(CL=1,VL用!S44,IF(CL=2,VL用!AN44,IF(CL=3,VL用!BI44,IF(CL=4,VL用!CD44,IF(CL=5,VL用!CY44,IF(CL=6,VL用!DT44,IF(CL=7,VL用!EO44,IF(CL=8,VL用!FJ44,IF(CL=9,VL用!GE44,VL用!GZ44)))))))))","v":20},{"$f":"IF(CL=1,VL用!T44,IF(CL=2,VL用!AO44,IF(CL=3,VL用!BJ44,IF(CL=4,VL用!CE44,IF(CL=5,VL用!CZ44,IF(CL=6,VL用!DU44,IF(CL=7,VL用!EP44,IF(CL=8,VL用!FK44,IF(CL=9,VL用!GF44,VL用!HA44)))))))))","v":20},{"$f":"IF(CL=1,VL用!U44,IF(CL=2,VL用!AP44,IF(CL=3,VL用!BK44,IF(CL=4,VL用!CF44,IF(CL=5,VL用!DA44,IF(CL=6,VL用!DV44,IF(CL=7,VL用!EQ44,IF(CL=8,VL用!FL44,IF(CL=9,VL用!GG44,VL用!HB44)))))))))","v":25},{"$f":"IF(CL=1,VL用!V44,IF(CL=2,VL用!AQ44,IF(CL=3,VL用!BL44,IF(CL=4,VL用!CG44,IF(CL=5,VL用!DB44,IF(CL=6,VL用!DW44,IF(CL=7,VL用!ER44,IF(CL=8,VL用!FM44,IF(CL=9,VL用!GH44,VL用!HC44)))))))))","v":-25},{"$f":"IF(CL=1,VL用!W44,IF(CL=2,VL用!AR44,IF(CL=3,VL用!BM44,IF(CL=4,VL用!CH44,IF(CL=5,VL用!DC44,IF(CL=6,VL用!DX44,IF(CL=7,VL用!ES44,IF(CL=8,VL用!FN44,IF(CL=9,VL用!GI44,VL用!HD44)))))))))","v":5},{"$f":"IF(CL=1,VL用!X44,IF(CL=2,VL用!AS44,IF(CL=3,VL用!BN44,IF(CL=4,VL用!CI44,IF(CL=5,VL用!DD44,IF(CL=6,VL用!DY44,IF(CL=7,VL用!ET44,IF(CL=8,VL用!FO44,IF(CL=9,VL用!GJ44,VL用!HE44)))))))))","v":5},{"$f":"IF(CL=1,VL用!Y44,IF(CL=2,VL用!AT44,IF(CL=3,VL用!BO44,IF(CL=4,VL用!CJ44,IF(CL=5,VL用!DE44,IF(CL=6,VL用!DZ44,IF(CL=7,VL用!EU44,IF(CL=8,VL用!FP44,IF(CL=9,VL用!GK44,VL用!HF44)))))))))","v":3},{"$f":"IF(CL=1,VL用!Z44,IF(CL=2,VL用!AU44,IF(CL=3,VL用!BP44,IF(CL=4,VL用!CK44,IF(CL=5,VL用!DF44,IF(CL=6,VL用!EA44,IF(CL=7,VL用!EV44,IF(CL=8,VL用!FQ44,IF(CL=9,VL用!GL44,VL用!HG44)))))))))","v":3},"フリーズバインド",null,null,"★","自","ｵｰﾄ","自","なし","自動","1BP",0,"攻撃宣言時に使用。命中C値-2 達成値+1し、回避判定振り直し不可。"]
[null,"魔道士",{"$f":"VL用!B19+CL","v":6},{"$f":"VL用!C19+CL","v":9},{"$f":"VL用!D19+CL","v":9},{"$f":"VL用!E19+CL","v":15},{"$f":"VL用!F19+CL","v":6},{"$f":"\"「種別：魔」かつ「単体」のｽｷﾙが回避されたとき、同属性\"&20+CL*3&\"点ﾀﾞﾒｰｼﾞを与える。\"","v":"「種別：魔」かつ「単体」のｽｷﾙが回避されたとき、同属性23点ﾀﾞﾒｰｼﾞを与える。"},null,null,null,null,null,null,null,null,null,null,{"$f":"IF(CL=1,VL用!G45,IF(CL=2,VL用!AB45,IF(CL=3,VL用!AW45,IF(CL=4,VL用!BR45,IF(CL=5,VL用!CM45,IF(CL=6,VL用!DH45,IF(CL=7,VL用!EC45,IF(CL=8,VL用!EX45,IF(CL=9,VL用!FS45,VL用!GN45)))))))))","v":3},{"$f":"IF(CL=1,VL用!H45,IF(CL=2,VL用!AC45,IF(CL=3,VL用!AX45,IF(CL=4,VL用!BS45,IF(CL=5,VL用!CN45,IF(CL=6,VL用!DI45,IF(CL=7,VL用!ED45,IF(CL=8,VL用!EY45,IF(CL=9,VL用!FT45,VL用!GO45)))))))))","v":2},{"$f":"IF(CL=1,VL用!I45,IF(CL=2,VL用!AD45,IF(CL=3,VL用!AY45,IF(CL=4,VL用!BT45,IF(CL=5,VL用!CO45,IF(CL=6,VL用!DJ45,IF(CL=7,VL用!EE45,IF(CL=8,VL用!EZ45,IF(CL=9,VL用!FU45,VL用!GP45)))))))))","v":3},{"$f":"IF(CL=1,VL用!J45,IF(CL=2,VL用!AE45,IF(CL=3,VL用!AZ45,IF(CL=4,VL用!BU45,IF(CL=5,VL用!CP45,IF(CL=6,VL用!DK45,IF(CL=7,VL用!EF45,IF(CL=8,VL用!FA45,IF(CL=9,VL用!FV45,VL用!GQ45)))))))))","v":5},{"$f":"IF(CL=1,VL用!K45,IF(CL=2,VL用!AF45,IF(CL=3,VL用!BA45,IF(CL=4,VL用!BV45,IF(CL=5,VL用!CQ45,IF(CL=6,VL用!DL45,IF(CL=7,VL用!EG45,IF(CL=8,VL用!FB45,IF(CL=9,VL用!FW45,VL用!GR45)))))))))","v":4},{"$f":"IF(CL=1,VL用!L45,IF(CL=2,VL用!AG45,IF(CL=3,VL用!BB45,IF(CL=4,VL用!BW45,IF(CL=5,VL用!CR45,IF(CL=6,VL用!DM45,IF(CL=7,VL用!EH45,IF(CL=8,VL用!FC45,IF(CL=9,VL用!FX45,VL用!GS45)))))))))","v":3},{"$f":"IF(CL=1,VL用!M45,IF(CL=2,VL用!AH45,IF(CL=3,VL用!BC45,IF(CL=4,VL用!BX45,IF(CL=5,VL用!CS45,IF(CL=6,VL用!DN45,IF(CL=7,VL用!EI45,IF(CL=8,VL用!FD45,IF(CL=9,VL用!FY45,VL用!GT45)))))))))","v":6},{"$f":"IF(CL=1,VL用!N45,IF(CL=2,VL用!AI45,IF(CL=3,VL用!BD45,IF(CL=4,VL用!BY45,IF(CL=5,VL用!CT45,IF(CL=6,VL用!DO45,IF(CL=7,VL用!EJ45,IF(CL=8,VL用!FE45,IF(CL=9,VL用!FZ45,VL用!GU45)))))))))","v":14},{"$f":"IF(CL=1,VL用!O45,IF(CL=2,VL用!AJ45,IF(CL=3,VL用!BE45,IF(CL=4,VL用!BZ45,IF(CL=5,VL用!CU45,IF(CL=6,VL用!DP45,IF(CL=7,VL用!EK45,IF(CL=8,VL用!FF45,IF(CL=9,VL用!GA45,VL用!GV45)))))))))","v":83},{"$f":"IF(CL=1,VL用!P45,IF(CL=2,VL用!AK45,IF(CL=3,VL用!BF45,IF(CL=4,VL用!CA45,IF(CL=5,VL用!CV45,IF(CL=6,VL用!DQ45,IF(CL=7,VL用!EL45,IF(CL=8,VL用!FG45,IF(CL=9,VL用!GB45,VL用!GW45)))))))))","v":39},{"$f":"IF(CL=1,VL用!Q45,IF(CL=2,VL用!AL45,IF(CL=3,VL用!BG45,IF(CL=4,VL用!CB45,IF(CL=5,VL用!CW45,IF(CL=6,VL用!DR45,IF(CL=7,VL用!EM45,IF(CL=8,VL用!FH45,IF(CL=9,VL用!GC45,VL用!GX45)))))))))","v":-3},{"$f":"IF(CL=1,VL用!R45,IF(CL=2,VL用!AM45,IF(CL=3,VL用!BH45,IF(CL=4,VL用!CC45,IF(CL=5,VL用!CX45,IF(CL=6,VL用!DS45,IF(CL=7,VL用!EN45,IF(CL=8,VL用!FI45,IF(CL=9,VL用!GD45,VL用!GY45)))))))))","v":3},{"$f":"IF(CL=1,VL用!S45,IF(CL=2,VL用!AN45,IF(CL=3,VL用!BI45,IF(CL=4,VL用!CD45,IF(CL=5,VL用!CY45,IF(CL=6,VL用!DT45,IF(CL=7,VL用!EO45,IF(CL=8,VL用!FJ45,IF(CL=9,VL用!GE45,VL用!GZ45)))))))))","v":2},{"$f":"IF(CL=1,VL用!T45,IF(CL=2,VL用!AO45,IF(CL=3,VL用!BJ45,IF(CL=4,VL用!CE45,IF(CL=5,VL用!CZ45,IF(CL=6,VL用!DU45,IF(CL=7,VL用!EP45,IF(CL=8,VL用!FK45,IF(CL=9,VL用!GF45,VL用!HA45)))))))))","v":2},{"$f":"IF(CL=1,VL用!U45,IF(CL=2,VL用!AP45,IF(CL=3,VL用!BK45,IF(CL=4,VL用!CF45,IF(CL=5,VL用!DA45,IF(CL=6,VL用!DV45,IF(CL=7,VL用!EQ45,IF(CL=8,VL用!FL45,IF(CL=9,VL用!GG45,VL用!HB45)))))))))","v":2},{"$f":"IF(CL=1,VL用!V45,IF(CL=2,VL用!AQ45,IF(CL=3,VL用!BL45,IF(CL=4,VL用!CG45,IF(CL=5,VL用!DB45,IF(CL=6,VL用!DW45,IF(CL=7,VL用!ER45,IF(CL=8,VL用!FM45,IF(CL=9,VL用!GH45,VL用!HC45)))))))))","v":2},{"$f":"IF(CL=1,VL用!W45,IF(CL=2,VL用!AR45,IF(CL=3,VL用!BM45,IF(CL=4,VL用!CH45,IF(CL=5,VL用!DC45,IF(CL=6,VL用!DX45,IF(CL=7,VL用!ES45,IF(CL=8,VL用!FN45,IF(CL=9,VL用!GI45,VL用!HD45)))))))))","v":2},{"$f":"IF(CL=1,VL用!X45,IF(CL=2,VL用!AS45,IF(CL=3,VL用!BN45,IF(CL=4,VL用!CI45,IF(CL=5,VL用!DD45,IF(CL=6,VL用!DY45,IF(CL=7,VL用!ET45,IF(CL=8,VL用!FO45,IF(CL=9,VL用!GJ45,VL用!HE45)))))))))","v":2},{"$f":"IF(CL=1,VL用!Y45,IF(CL=2,VL用!AT45,IF(CL=3,VL用!BO45,IF(CL=4,VL用!CJ45,IF(CL=5,VL用!DE45,IF(CL=6,VL用!DZ45,IF(CL=7,VL用!EU45,IF(CL=8,VL用!FP45,IF(CL=9,VL用!GK45,VL用!HF45)))))))))","v":10},{"$f":"IF(CL=1,VL用!Z45,IF(CL=2,VL用!AU45,IF(CL=3,VL用!BP45,IF(CL=4,VL用!CK45,IF(CL=5,VL用!DF45,IF(CL=6,VL用!EA45,IF(CL=7,VL用!EV45,IF(CL=8,VL用!FQ45,IF(CL=9,VL用!GL45,VL用!HG45)))))))))","v":10},"予備魔力開放",null,null,"★","自","ｵｰﾄ","自","なし","自動","NBP",0,{"$f":"\"①C開始時使用→HP&MP[N*\"&CL+8&\"]点回復。②ﾀﾞﾒﾛ直前使用→与D+[N*\"&CL+10&\"]\"","v":"①C開始時使用→HP&MP[N*9]点回復。②ﾀﾞﾒﾛ直前使用→与D+[N*11]"}]
[null,"付喪神",{"$f":"VL用!B20+CL","v":5},{"$f":"VL用!C20+CL","v":8},{"$f":"VL用!D20+CL","v":9},{"$f":"VL用!E20+CL","v":8},{"$f":"VL用!F20+CL","v":15},"ｶｳﾝﾄ開始時に任意ﾏｽ配置可能 1/Sce & 単体攻撃ｽｷﾙの命中C値-2",null,null,null,null,null,null,null,null,null,null,{"$f":"IF(CL=1,VL用!G46,IF(CL=2,VL用!AB46,IF(CL=3,VL用!AW46,IF(CL=4,VL用!BR46,IF(CL=5,VL用!CM46,IF(CL=6,VL用!DH46,IF(CL=7,VL用!EC46,IF(CL=8,VL用!EX46,IF(CL=9,VL用!FS46,VL用!GN46)))))))))","v":4},{"$f":"IF(CL=1,VL用!H46,IF(CL=2,VL用!AC46,IF(CL=3,VL用!AX46,IF(CL=4,VL用!BS46,IF(CL=5,VL用!CN46,IF(CL=6,VL用!DI46,IF(CL=7,VL用!ED46,IF(CL=8,VL用!EY46,IF(CL=9,VL用!FT46,VL用!GO46)))))))))","v":4},{"$f":"IF(CL=1,VL用!I46,IF(CL=2,VL用!AD46,IF(CL=3,VL用!AY46,IF(CL=4,VL用!BT46,IF(CL=5,VL用!CO46,IF(CL=6,VL用!DJ46,IF(CL=7,VL用!EE46,IF(CL=8,VL用!EZ46,IF(CL=9,VL用!FU46,VL用!GP46)))))))))","v":4},{"$f":"IF(CL=1,VL用!J46,IF(CL=2,VL用!AE46,IF(CL=3,VL用!AZ46,IF(CL=4,VL用!BU46,IF(CL=5,VL用!CP46,IF(CL=6,VL用!DK46,IF(CL=7,VL用!EF46,IF(CL=8,VL用!FA46,IF(CL=9,VL用!FV46,VL用!GQ46)))))))))","v":4},{"$f":"IF(CL=1,VL用!K46,IF(CL=2,VL用!AF46,IF(CL=3,VL用!BA46,IF(CL=4,VL用!BV46,IF(CL=5,VL用!CQ46,IF(CL=6,VL用!DL46,IF(CL=7,VL用!EG46,IF(CL=8,VL用!FB46,IF(CL=9,VL用!FW46,VL用!GR46)))))))))","v":3},{"$f":"IF(CL=1,VL用!L46,IF(CL=2,VL用!AG46,IF(CL=3,VL用!BB46,IF(CL=4,VL用!BW46,IF(CL=5,VL用!CR46,IF(CL=6,VL用!DM46,IF(CL=7,VL用!EH46,IF(CL=8,VL用!FC46,IF(CL=9,VL用!FX46,VL用!GS46)))))))))","v":3},{"$f":"IF(CL=1,VL用!M46,IF(CL=2,VL用!AH46,IF(CL=3,VL用!BC46,IF(CL=4,VL用!BX46,IF(CL=5,VL用!CS46,IF(CL=6,VL用!DN46,IF(CL=7,VL用!EI46,IF(CL=8,VL用!FD46,IF(CL=9,VL用!FY46,VL用!GT46)))))))))","v":8},{"$f":"IF(CL=1,VL用!N46,IF(CL=2,VL用!AI46,IF(CL=3,VL用!BD46,IF(CL=4,VL用!BY46,IF(CL=5,VL用!CT46,IF(CL=6,VL用!DO46,IF(CL=7,VL用!EJ46,IF(CL=8,VL用!FE46,IF(CL=9,VL用!FZ46,VL用!GU46)))))))))","v":8},{"$f":"IF(CL=1,VL用!O46,IF(CL=2,VL用!AJ46,IF(CL=3,VL用!BE46,IF(CL=4,VL用!BZ46,IF(CL=5,VL用!CU46,IF(CL=6,VL用!DP46,IF(CL=7,VL用!EK46,IF(CL=8,VL用!FF46,IF(CL=9,VL用!GA46,VL用!GV46)))))))))","v":98},{"$f":"IF(CL=1,VL用!P46,IF(CL=2,VL用!AK46,IF(CL=3,VL用!BF46,IF(CL=4,VL用!CA46,IF(CL=5,VL用!CV46,IF(CL=6,VL用!DQ46,IF(CL=7,VL用!EL46,IF(CL=8,VL用!FG46,IF(CL=9,VL用!GB46,VL用!GW46)))))))))","v":28},{"$f":"IF(CL=1,VL用!Q46,IF(CL=2,VL用!AL46,IF(CL=3,VL用!BG46,IF(CL=4,VL用!CB46,IF(CL=5,VL用!CW46,IF(CL=6,VL用!DR46,IF(CL=7,VL用!EM46,IF(CL=8,VL用!FH46,IF(CL=9,VL用!GC46,VL用!GX46)))))))))","v":4},{"$f":"IF(CL=1,VL用!R46,IF(CL=2,VL用!AM46,IF(CL=3,VL用!BH46,IF(CL=4,VL用!CC46,IF(CL=5,VL用!CX46,IF(CL=6,VL用!DS46,IF(CL=7,VL用!EN46,IF(CL=8,VL用!FI46,IF(CL=9,VL用!GD46,VL用!GY46)))))))))","v":4},{"$f":"IF(CL=1,VL用!S46,IF(CL=2,VL用!AN46,IF(CL=3,VL用!BI46,IF(CL=4,VL用!CD46,IF(CL=5,VL用!CY46,IF(CL=6,VL用!DT46,IF(CL=7,VL用!EO46,IF(CL=8,VL用!FJ46,IF(CL=9,VL用!GE46,VL用!GZ46)))))))))","v":11},{"$f":"IF(CL=1,VL用!T46,IF(CL=2,VL用!AO46,IF(CL=3,VL用!BJ46,IF(CL=4,VL用!CE46,IF(CL=5,VL用!CZ46,IF(CL=6,VL用!DU46,IF(CL=7,VL用!EP46,IF(CL=8,VL用!FK46,IF(CL=9,VL用!GF46,VL用!HA46)))))))))","v":5},{"$f":"IF(CL=1,VL用!U46,IF(CL=2,VL用!AP46,IF(CL=3,VL用!BK46,IF(CL=4,VL用!CF46,IF(CL=5,VL用!DA46,IF(CL=6,VL用!DV46,IF(CL=7,VL用!EQ46,IF(CL=8,VL用!FL46,IF(CL=9,VL用!GG46,VL用!HB46)))))))))","v":8},{"$f":"IF(CL=1,VL用!V46,IF(CL=2,VL用!AQ46,IF(CL=3,VL用!BL46,IF(CL=4,VL用!CG46,IF(CL=5,VL用!DB46,IF(CL=6,VL用!DW46,IF(CL=7,VL用!ER46,IF(CL=8,VL用!FM46,IF(CL=9,VL用!GH46,VL用!HC46)))))))))","v":2},{"$f":"IF(CL=1,VL用!W46,IF(CL=2,VL用!AR46,IF(CL=3,VL用!BM46,IF(CL=4,VL用!CH46,IF(CL=5,VL用!DC46,IF(CL=6,VL用!DX46,IF(CL=7,VL用!ES46,IF(CL=8,VL用!FN46,IF(CL=9,VL用!GI46,VL用!HD46)))))))))","v":2},{"$f":"IF(CL=1,VL用!X46,IF(CL=2,VL用!AS46,IF(CL=3,VL用!BN46,IF(CL=4,VL用!CI46,IF(CL=5,VL用!DD46,IF(CL=6,VL用!DY46,IF(CL=7,VL用!ET46,IF(CL=8,VL用!FO46,IF(CL=9,VL用!GJ46,VL用!HE46)))))))))","v":-5},{"$f":"IF(CL=1,VL用!Y46,IF(CL=2,VL用!AT46,IF(CL=3,VL用!BO46,IF(CL=4,VL用!CJ46,IF(CL=5,VL用!DE46,IF(CL=6,VL用!DZ46,IF(CL=7,VL用!EU46,IF(CL=8,VL用!FP46,IF(CL=9,VL用!GK46,VL用!HF46)))))))))","v":8},{"$f":"IF(CL=1,VL用!Z46,IF(CL=2,VL用!AU46,IF(CL=3,VL用!BP46,IF(CL=4,VL用!CK46,IF(CL=5,VL用!DF46,IF(CL=6,VL用!EA46,IF(CL=7,VL用!EV46,IF(CL=8,VL用!FQ46,IF(CL=9,VL用!GL46,VL用!HG46)))))))))","v":2},"九十九神力",null,null,"★","自","ｵｰﾄ","自","なし","自動","7BP",0,"HPが0になる瞬間に使用可能。HP全回復して、BS全解除。"]
[null,"幽体",{"$f":"VL用!B21+CL","v":1},{"$f":"VL用!C21+CL","v":13},{"$f":"VL用!D21+CL","v":10},{"$f":"VL用!E21+CL","v":12},{"$f":"VL用!F21+CL","v":9},{"$f":"\"10ｶｳﾝﾄ毎に、MP\"&10+ROUNDUP(CL/2,0)&\"点減少 & MP0で戦闘不能 & 常時[感情の強度]+1\"","v":"10ｶｳﾝﾄ毎に、MP11点減少 & MP0で戦闘不能 & 常時[感情の強度]+1"},null,null,null,null,null,null,null,null,null,null,{"$f":"IF(CL=1,VL用!G47,IF(CL=2,VL用!AB47,IF(CL=3,VL用!AW47,IF(CL=4,VL用!BR47,IF(CL=5,VL用!CM47,IF(CL=6,VL用!DH47,IF(CL=7,VL用!EC47,IF(CL=8,VL用!EX47,IF(CL=9,VL用!FS47,VL用!GN47)))))))))","v":4},{"$f":"IF(CL=1,VL用!H47,IF(CL=2,VL用!AC47,IF(CL=3,VL用!AX47,IF(CL=4,VL用!BS47,IF(CL=5,VL用!CN47,IF(CL=6,VL用!DI47,IF(CL=7,VL用!ED47,IF(CL=8,VL用!EY47,IF(CL=9,VL用!FT47,VL用!GO47)))))))))","v":4},{"$f":"IF(CL=1,VL用!I47,IF(CL=2,VL用!AD47,IF(CL=3,VL用!AY47,IF(CL=4,VL用!BT47,IF(CL=5,VL用!CO47,IF(CL=6,VL用!DJ47,IF(CL=7,VL用!EE47,IF(CL=8,VL用!EZ47,IF(CL=9,VL用!FU47,VL用!GP47)))))))))","v":5},{"$f":"IF(CL=1,VL用!J47,IF(CL=2,VL用!AE47,IF(CL=3,VL用!AZ47,IF(CL=4,VL用!BU47,IF(CL=5,VL用!CP47,IF(CL=6,VL用!DK47,IF(CL=7,VL用!EF47,IF(CL=8,VL用!FA47,IF(CL=9,VL用!FV47,VL用!GQ47)))))))))","v":4},{"$f":"IF(CL=1,VL用!K47,IF(CL=2,VL用!AF47,IF(CL=3,VL用!BA47,IF(CL=4,VL用!BV47,IF(CL=5,VL用!CQ47,IF(CL=6,VL用!DL47,IF(CL=7,VL用!EG47,IF(CL=8,VL用!FB47,IF(CL=9,VL用!FW47,VL用!GR47)))))))))","v":5},{"$f":"IF(CL=1,VL用!L47,IF(CL=2,VL用!AG47,IF(CL=3,VL用!BB47,IF(CL=4,VL用!BW47,IF(CL=5,VL用!CR47,IF(CL=6,VL用!DM47,IF(CL=7,VL用!EH47,IF(CL=8,VL用!FC47,IF(CL=9,VL用!FX47,VL用!GS47)))))))))","v":6},{"$f":"IF(CL=1,VL用!M47,IF(CL=2,VL用!AH47,IF(CL=3,VL用!BC47,IF(CL=4,VL用!BX47,IF(CL=5,VL用!CS47,IF(CL=6,VL用!DN47,IF(CL=7,VL用!EI47,IF(CL=8,VL用!FD47,IF(CL=9,VL用!FY47,VL用!GT47)))))))))","v":6},{"$f":"IF(CL=1,VL用!N47,IF(CL=2,VL用!AI47,IF(CL=3,VL用!BD47,IF(CL=4,VL用!BY47,IF(CL=5,VL用!CT47,IF(CL=6,VL用!DO47,IF(CL=7,VL用!EJ47,IF(CL=8,VL用!FE47,IF(CL=9,VL用!FZ47,VL用!GU47)))))))))","v":12},{"$f":"IF(CL=1,VL用!O47,IF(CL=2,VL用!AJ47,IF(CL=3,VL用!BE47,IF(CL=4,VL用!BZ47,IF(CL=5,VL用!CU47,IF(CL=6,VL用!DP47,IF(CL=7,VL用!EK47,IF(CL=8,VL用!FF47,IF(CL=9,VL用!GA47,VL用!GV47)))))))))","v":102},{"$f":"IF(CL=1,VL用!P47,IF(CL=2,VL用!AK47,IF(CL=3,VL用!BF47,IF(CL=4,VL用!CA47,IF(CL=5,VL用!CV47,IF(CL=6,VL用!DQ47,IF(CL=7,VL用!EL47,IF(CL=8,VL用!FG47,IF(CL=9,VL用!GB47,VL用!GW47)))))))))","v":30},{"$f":"IF(CL=1,VL用!Q47,IF(CL=2,VL用!AL47,IF(CL=3,VL用!BG47,IF(CL=4,VL用!CB47,IF(CL=5,VL用!CW47,IF(CL=6,VL用!DR47,IF(CL=7,VL用!EM47,IF(CL=8,VL用!FH47,IF(CL=9,VL用!GC47,VL用!GX47)))))))))","v":28},{"$f":"IF(CL=1,VL用!R47,IF(CL=2,VL用!AM47,IF(CL=3,VL用!BH47,IF(CL=4,VL用!CC47,IF(CL=5,VL用!CX47,IF(CL=6,VL用!DS47,IF(CL=7,VL用!EN47,IF(CL=8,VL用!FI47,IF(CL=9,VL用!GD47,VL用!GY47)))))))))","v":27},{"$f":"IF(CL=1,VL用!S47,IF(CL=2,VL用!AN47,IF(CL=3,VL用!BI47,IF(CL=4,VL用!CD47,IF(CL=5,VL用!CY47,IF(CL=6,VL用!DT47,IF(CL=7,VL用!EO47,IF(CL=8,VL用!FJ47,IF(CL=9,VL用!GE47,VL用!GZ47)))))))))","v":0},{"$f":"IF(CL=1,VL用!T47,IF(CL=2,VL用!AO47,IF(CL=3,VL用!BJ47,IF(CL=4,VL用!CE47,IF(CL=5,VL用!CZ47,IF(CL=6,VL用!DU47,IF(CL=7,VL用!EP47,IF(CL=8,VL用!FK47,IF(CL=9,VL用!GF47,VL用!HA47)))))))))","v":3},{"$f":"IF(CL=1,VL用!U47,IF(CL=2,VL用!AP47,IF(CL=3,VL用!BK47,IF(CL=4,VL用!CF47,IF(CL=5,VL用!DA47,IF(CL=6,VL用!DV47,IF(CL=7,VL用!EQ47,IF(CL=8,VL用!FL47,IF(CL=9,VL用!GG47,VL用!HB47)))))))))","v":4},{"$f":"IF(CL=1,VL用!V47,IF(CL=2,VL用!AQ47,IF(CL=3,VL用!BL47,IF(CL=4,VL用!CG47,IF(CL=5,VL用!DB47,IF(CL=6,VL用!DW47,IF(CL=7,VL用!ER47,IF(CL=8,VL用!FM47,IF(CL=9,VL用!GH47,VL用!HC47)))))))))","v":17},{"$f":"IF(CL=1,VL用!W47,IF(CL=2,VL用!AR47,IF(CL=3,VL用!BM47,IF(CL=4,VL用!CH47,IF(CL=5,VL用!DC47,IF(CL=6,VL用!DX47,IF(CL=7,VL用!ES47,IF(CL=8,VL用!FN47,IF(CL=9,VL用!GI47,VL用!HD47)))))))))","v":3},{"$f":"IF(CL=1,VL用!X47,IF(CL=2,VL用!AS47,IF(CL=3,VL用!BN47,IF(CL=4,VL用!CI47,IF(CL=5,VL用!DD47,IF(CL=6,VL用!DY47,IF(CL=7,VL用!ET47,IF(CL=8,VL用!FO47,IF(CL=9,VL用!GJ47,VL用!HE47)))))))))","v":4},{"$f":"IF(CL=1,VL用!Y47,IF(CL=2,VL用!AT47,IF(CL=3,VL用!BO47,IF(CL=4,VL用!CJ47,IF(CL=5,VL用!DE47,IF(CL=6,VL用!DZ47,IF(CL=7,VL用!EU47,IF(CL=8,VL用!FP47,IF(CL=9,VL用!GK47,VL用!HF47)))))))))","v":-30},{"$f":"IF(CL=1,VL用!Z47,IF(CL=2,VL用!AU47,IF(CL=3,VL用!BP47,IF(CL=4,VL用!CK47,IF(CL=5,VL用!DF47,IF(CL=6,VL用!EA47,IF(CL=7,VL用!EV47,IF(CL=8,VL用!FQ47,IF(CL=9,VL用!GL47,VL用!HG47)))))))))","v":14},"ソウルシード",null,null,"★","自","ｵｰﾄ","自","なし","自動","10BP",0,{"$f":"\"C開始時に使用。HP&MP全回復 その後、行動手番毎にMP[\"&CL&\"+2D10]点回復\"","v":"C開始時に使用。HP&MP全回復 その後、行動手番毎にMP[1+2D10]点回復"}]
[null,"鬼",{"$f":"VL用!B22+CL","v":15},{"$f":"VL用!C22+CL","v":5},{"$f":"VL用!D22+CL","v":15},{"$f":"VL用!E22+CL","v":5},{"$f":"VL用!F22+CL","v":5},"CまたはFの自身判定振り直し不可 & 怯み無効",null,null,null,null,null,null,null,null,null,null,{"$f":"IF(CL=1,VL用!G48,IF(CL=2,VL用!AB48,IF(CL=3,VL用!AW48,IF(CL=4,VL用!BR48,IF(CL=5,VL用!CM48,IF(CL=6,VL用!DH48,IF(CL=7,VL用!EC48,IF(CL=8,VL用!EX48,IF(CL=9,VL用!FS48,VL用!GN48)))))))))","v":5},{"$f":"IF(CL=1,VL用!H48,IF(CL=2,VL用!AC48,IF(CL=3,VL用!AX48,IF(CL=4,VL用!BS48,IF(CL=5,VL用!CN48,IF(CL=6,VL用!DI48,IF(CL=7,VL用!ED48,IF(CL=8,VL用!EY48,IF(CL=9,VL用!FT48,VL用!GO48)))))))))","v":4},{"$f":"IF(CL=1,VL用!I48,IF(CL=2,VL用!AD48,IF(CL=3,VL用!AY48,IF(CL=4,VL用!BT48,IF(CL=5,VL用!CO48,IF(CL=6,VL用!DJ48,IF(CL=7,VL用!EE48,IF(CL=8,VL用!EZ48,IF(CL=9,VL用!FU48,VL用!GP48)))))))))","v":3},{"$f":"IF(CL=1,VL用!J48,IF(CL=2,VL用!AE48,IF(CL=3,VL用!AZ48,IF(CL=4,VL用!BU48,IF(CL=5,VL用!CP48,IF(CL=6,VL用!DK48,IF(CL=7,VL用!EF48,IF(CL=8,VL用!FA48,IF(CL=9,VL用!FV48,VL用!GQ48)))))))))","v":5},{"$f":"IF(CL=1,VL用!K48,IF(CL=2,VL用!AF48,IF(CL=3,VL用!BA48,IF(CL=4,VL用!BV48,IF(CL=5,VL用!CQ48,IF(CL=6,VL用!DL48,IF(CL=7,VL用!EG48,IF(CL=8,VL用!FB48,IF(CL=9,VL用!FW48,VL用!GR48)))))))))","v":3},{"$f":"IF(CL=1,VL用!L48,IF(CL=2,VL用!AG48,IF(CL=3,VL用!BB48,IF(CL=4,VL用!BW48,IF(CL=5,VL用!CR48,IF(CL=6,VL用!DM48,IF(CL=7,VL用!EH48,IF(CL=8,VL用!FC48,IF(CL=9,VL用!FX48,VL用!GS48)))))))))","v":2},{"$f":"IF(CL=1,VL用!M48,IF(CL=2,VL用!AH48,IF(CL=3,VL用!BC48,IF(CL=4,VL用!BX48,IF(CL=5,VL用!CS48,IF(CL=6,VL用!DN48,IF(CL=7,VL用!EI48,IF(CL=8,VL用!FD48,IF(CL=9,VL用!FY48,VL用!GT48)))))))))","v":18},{"$f":"IF(CL=1,VL用!N48,IF(CL=2,VL用!AI48,IF(CL=3,VL用!BD48,IF(CL=4,VL用!BY48,IF(CL=5,VL用!CT48,IF(CL=6,VL用!DO48,IF(CL=7,VL用!EJ48,IF(CL=8,VL用!FE48,IF(CL=9,VL用!FZ48,VL用!GU48)))))))))","v":17},{"$f":"IF(CL=1,VL用!O48,IF(CL=2,VL用!AJ48,IF(CL=3,VL用!BE48,IF(CL=4,VL用!BZ48,IF(CL=5,VL用!CU48,IF(CL=6,VL用!DP48,IF(CL=7,VL用!EK48,IF(CL=8,VL用!FF48,IF(CL=9,VL用!GA48,VL用!GV48)))))))))","v":104},{"$f":"IF(CL=1,VL用!P48,IF(CL=2,VL用!AK48,IF(CL=3,VL用!BF48,IF(CL=4,VL用!CA48,IF(CL=5,VL用!CV48,IF(CL=6,VL用!DQ48,IF(CL=7,VL用!EL48,IF(CL=8,VL用!FG48,IF(CL=9,VL用!GB48,VL用!GW48)))))))))","v":20},{"$f":"IF(CL=1,VL用!Q48,IF(CL=2,VL用!AL48,IF(CL=3,VL用!BG48,IF(CL=4,VL用!CB48,IF(CL=5,VL用!CW48,IF(CL=6,VL用!DR48,IF(CL=7,VL用!EM48,IF(CL=8,VL用!FH48,IF(CL=9,VL用!GC48,VL用!GX48)))))))))","v":27},{"$f":"IF(CL=1,VL用!R48,IF(CL=2,VL用!AM48,IF(CL=3,VL用!BH48,IF(CL=4,VL用!CC48,IF(CL=5,VL用!CX48,IF(CL=6,VL用!DS48,IF(CL=7,VL用!EN48,IF(CL=8,VL用!FI48,IF(CL=9,VL用!GD48,VL用!GY48)))))))))","v":26},{"$f":"IF(CL=1,VL用!S48,IF(CL=2,VL用!AN48,IF(CL=3,VL用!BI48,IF(CL=4,VL用!CD48,IF(CL=5,VL用!CY48,IF(CL=6,VL用!DT48,IF(CL=7,VL用!EO48,IF(CL=8,VL用!FJ48,IF(CL=9,VL用!GE48,VL用!GZ48)))))))))","v":5},{"$f":"IF(CL=1,VL用!T48,IF(CL=2,VL用!AO48,IF(CL=3,VL用!BJ48,IF(CL=4,VL用!CE48,IF(CL=5,VL用!CZ48,IF(CL=6,VL用!DU48,IF(CL=7,VL用!EP48,IF(CL=8,VL用!FK48,IF(CL=9,VL用!GF48,VL用!HA48)))))))))","v":5},{"$f":"IF(CL=1,VL用!U48,IF(CL=2,VL用!AP48,IF(CL=3,VL用!BK48,IF(CL=4,VL用!CF48,IF(CL=5,VL用!DA48,IF(CL=6,VL用!DV48,IF(CL=7,VL用!EQ48,IF(CL=8,VL用!FL48,IF(CL=9,VL用!GG48,VL用!HB48)))))))))","v":2},{"$f":"IF(CL=1,VL用!V48,IF(CL=2,VL用!AQ48,IF(CL=3,VL用!BL48,IF(CL=4,VL用!CG48,IF(CL=5,VL用!DB48,IF(CL=6,VL用!DW48,IF(CL=7,VL用!ER48,IF(CL=8,VL用!FM48,IF(CL=9,VL用!GH48,VL用!HC48)))))))))","v":6},{"$f":"IF(CL=1,VL用!W48,IF(CL=2,VL用!AR48,IF(CL=3,VL用!BM48,IF(CL=4,VL用!CH48,IF(CL=5,VL用!DC48,IF(CL=6,VL用!DX48,IF(CL=7,VL用!ES48,IF(CL=8,VL用!FN48,IF(CL=9,VL用!GI48,VL用!HD48)))))))))","v":2},{"$f":"IF(CL=1,VL用!X48,IF(CL=2,VL用!AS48,IF(CL=3,VL用!BN48,IF(CL=4,VL用!CI48,IF(CL=5,VL用!DD48,IF(CL=6,VL用!DY48,IF(CL=7,VL用!ET48,IF(CL=8,VL用!FO48,IF(CL=9,VL用!GJ48,VL用!HE48)))))))))","v":3},{"$f":"IF(CL=1,VL用!Y48,IF(CL=2,VL用!AT48,IF(CL=3,VL用!BO48,IF(CL=4,VL用!CJ48,IF(CL=5,VL用!DE48,IF(CL=6,VL用!DZ48,IF(CL=7,VL用!EU48,IF(CL=8,VL用!FP48,IF(CL=9,VL用!GK48,VL用!HF48)))))))))","v":-3},{"$f":"IF(CL=1,VL用!Z48,IF(CL=2,VL用!AU48,IF(CL=3,VL用!BP48,IF(CL=4,VL用!CK48,IF(CL=5,VL用!DF48,IF(CL=6,VL用!EA48,IF(CL=7,VL用!EV48,IF(CL=8,VL用!FQ48,IF(CL=9,VL用!GL48,VL用!HG48)))))))))","v":-3},"Unlimited Power",null,null,"★","自","ｵｰﾄ","自","なし","自動","9BP",0,{"$f":"\"この戦闘中ｽｷﾙ攻撃で与えるダメージに+現カウント (上限値：\"&CL*6+40&\")\"","v":"この戦闘中ｽｷﾙ攻撃で与えるダメージに+現カウント (上限値：46)"}]
[null,"爬虫人",{"$f":"VL用!B23+CL","v":11},{"$f":"VL用!C23+CL","v":11},{"$f":"VL用!D23+CL","v":11},{"$f":"VL用!E23+CL","v":5},{"$f":"VL用!F23+CL","v":7},"BSを1D10<=2で無効。命中F値-2 (下限値：3)",null,null,null,null,null,null,null,null,null,null,{"$f":"IF(CL=1,VL用!G49,IF(CL=2,VL用!AB49,IF(CL=3,VL用!AW49,IF(CL=4,VL用!BR49,IF(CL=5,VL用!CM49,IF(CL=6,VL用!DH49,IF(CL=7,VL用!EC49,IF(CL=8,VL用!EX49,IF(CL=9,VL用!FS49,VL用!GN49)))))))))","v":4},{"$f":"IF(CL=1,VL用!H49,IF(CL=2,VL用!AC49,IF(CL=3,VL用!AX49,IF(CL=4,VL用!BS49,IF(CL=5,VL用!CN49,IF(CL=6,VL用!DI49,IF(CL=7,VL用!ED49,IF(CL=8,VL用!EY49,IF(CL=9,VL用!FT49,VL用!GO49)))))))))","v":5},{"$f":"IF(CL=1,VL用!I49,IF(CL=2,VL用!AD49,IF(CL=3,VL用!AY49,IF(CL=4,VL用!BT49,IF(CL=5,VL用!CO49,IF(CL=6,VL用!DJ49,IF(CL=7,VL用!EE49,IF(CL=8,VL用!EZ49,IF(CL=9,VL用!FU49,VL用!GP49)))))))))","v":3},{"$f":"IF(CL=1,VL用!J49,IF(CL=2,VL用!AE49,IF(CL=3,VL用!AZ49,IF(CL=4,VL用!BU49,IF(CL=5,VL用!CP49,IF(CL=6,VL用!DK49,IF(CL=7,VL用!EF49,IF(CL=8,VL用!FA49,IF(CL=9,VL用!FV49,VL用!GQ49)))))))))","v":3},{"$f":"IF(CL=1,VL用!K49,IF(CL=2,VL用!AF49,IF(CL=3,VL用!BA49,IF(CL=4,VL用!BV49,IF(CL=5,VL用!CQ49,IF(CL=6,VL用!DL49,IF(CL=7,VL用!EG49,IF(CL=8,VL用!FB49,IF(CL=9,VL用!FW49,VL用!GR49)))))))))","v":2},{"$f":"IF(CL=1,VL用!L49,IF(CL=2,VL用!AG49,IF(CL=3,VL用!BB49,IF(CL=4,VL用!BW49,IF(CL=5,VL用!CR49,IF(CL=6,VL用!DM49,IF(CL=7,VL用!EH49,IF(CL=8,VL用!FC49,IF(CL=9,VL用!FX49,VL用!GS49)))))))))","v":4},{"$f":"IF(CL=1,VL用!M49,IF(CL=2,VL用!AH49,IF(CL=3,VL用!BC49,IF(CL=4,VL用!BX49,IF(CL=5,VL用!CS49,IF(CL=6,VL用!DN49,IF(CL=7,VL用!EI49,IF(CL=8,VL用!FD49,IF(CL=9,VL用!FY49,VL用!GT49)))))))))","v":10},{"$f":"IF(CL=1,VL用!N49,IF(CL=2,VL用!AI49,IF(CL=3,VL用!BD49,IF(CL=4,VL用!BY49,IF(CL=5,VL用!CT49,IF(CL=6,VL用!DO49,IF(CL=7,VL用!EJ49,IF(CL=8,VL用!FE49,IF(CL=9,VL用!FZ49,VL用!GU49)))))))))","v":13},{"$f":"IF(CL=1,VL用!O49,IF(CL=2,VL用!AJ49,IF(CL=3,VL用!BE49,IF(CL=4,VL用!BZ49,IF(CL=5,VL用!CU49,IF(CL=6,VL用!DP49,IF(CL=7,VL用!EK49,IF(CL=8,VL用!FF49,IF(CL=9,VL用!GA49,VL用!GV49)))))))))","v":117},{"$f":"IF(CL=1,VL用!P49,IF(CL=2,VL用!AK49,IF(CL=3,VL用!BF49,IF(CL=4,VL用!CA49,IF(CL=5,VL用!CV49,IF(CL=6,VL用!DQ49,IF(CL=7,VL用!EL49,IF(CL=8,VL用!FG49,IF(CL=9,VL用!GB49,VL用!GW49)))))))))","v":21},{"$f":"IF(CL=1,VL用!Q49,IF(CL=2,VL用!AL49,IF(CL=3,VL用!BG49,IF(CL=4,VL用!CB49,IF(CL=5,VL用!CW49,IF(CL=6,VL用!DR49,IF(CL=7,VL用!EM49,IF(CL=8,VL用!FH49,IF(CL=9,VL用!GC49,VL用!GX49)))))))))","v":17},{"$f":"IF(CL=1,VL用!R49,IF(CL=2,VL用!AM49,IF(CL=3,VL用!BH49,IF(CL=4,VL用!CC49,IF(CL=5,VL用!CX49,IF(CL=6,VL用!DS49,IF(CL=7,VL用!EN49,IF(CL=8,VL用!FI49,IF(CL=9,VL用!GD49,VL用!GY49)))))))))","v":17},{"$f":"IF(CL=1,VL用!S49,IF(CL=2,VL用!AN49,IF(CL=3,VL用!BI49,IF(CL=4,VL用!CD49,IF(CL=5,VL用!CY49,IF(CL=6,VL用!DT49,IF(CL=7,VL用!EO49,IF(CL=8,VL用!FJ49,IF(CL=9,VL用!GE49,VL用!GZ49)))))))))","v":38},{"$f":"IF(CL=1,VL用!T49,IF(CL=2,VL用!AO49,IF(CL=3,VL用!BJ49,IF(CL=4,VL用!CE49,IF(CL=5,VL用!CZ49,IF(CL=6,VL用!DU49,IF(CL=7,VL用!EP49,IF(CL=8,VL用!FK49,IF(CL=9,VL用!GF49,VL用!HA49)))))))))","v":6},{"$f":"IF(CL=1,VL用!U49,IF(CL=2,VL用!AP49,IF(CL=3,VL用!BK49,IF(CL=4,VL用!CF49,IF(CL=5,VL用!DA49,IF(CL=6,VL用!DV49,IF(CL=7,VL用!EQ49,IF(CL=8,VL用!FL49,IF(CL=9,VL用!GG49,VL用!HB49)))))))))","v":8},{"$f":"IF(CL=1,VL用!V49,IF(CL=2,VL用!AQ49,IF(CL=3,VL用!BL49,IF(CL=4,VL用!CG49,IF(CL=5,VL用!DB49,IF(CL=6,VL用!DW49,IF(CL=7,VL用!ER49,IF(CL=8,VL用!FM49,IF(CL=9,VL用!GH49,VL用!HC49)))))))))","v":3},{"$f":"IF(CL=1,VL用!W49,IF(CL=2,VL用!AR49,IF(CL=3,VL用!BM49,IF(CL=4,VL用!CH49,IF(CL=5,VL用!DC49,IF(CL=6,VL用!DX49,IF(CL=7,VL用!ES49,IF(CL=8,VL用!FN49,IF(CL=9,VL用!GI49,VL用!HD49)))))))))","v":-10},{"$f":"IF(CL=1,VL用!X49,IF(CL=2,VL用!AS49,IF(CL=3,VL用!BN49,IF(CL=4,VL用!CI49,IF(CL=5,VL用!DD49,IF(CL=6,VL用!DY49,IF(CL=7,VL用!ET49,IF(CL=8,VL用!FO49,IF(CL=9,VL用!GJ49,VL用!HE49)))))))))","v":3},{"$f":"IF(CL=1,VL用!Y49,IF(CL=2,VL用!AT49,IF(CL=3,VL用!BO49,IF(CL=4,VL用!CJ49,IF(CL=5,VL用!DE49,IF(CL=6,VL用!DZ49,IF(CL=7,VL用!EU49,IF(CL=8,VL用!FP49,IF(CL=9,VL用!GK49,VL用!HF49)))))))))","v":3},{"$f":"IF(CL=1,VL用!Z49,IF(CL=2,VL用!AU49,IF(CL=3,VL用!BP49,IF(CL=4,VL用!CK49,IF(CL=5,VL用!DF49,IF(CL=6,VL用!EA49,IF(CL=7,VL用!EV49,IF(CL=8,VL用!FQ49,IF(CL=9,VL用!GL49,VL用!HG49)))))))))","v":6},"スケイルシールド",null,null,"★","自","ﾀﾞﾒﾛ","自","なし","自動","1BP",0,{"$f":"\"自身の受けるダメージを\"&CL*12+60&\"点軽減。ダメージ0の場合 MP\"&CL+5&\"点回復\"","v":"自身の受けるダメージを72点軽減。ダメージ0の場合 MP6点回復"}]
[null,"キメラ忌",null,null,null,null,null,null,null,null,null,null,null,null,null,null,null,null,null,null,null,null,null,null,null,null,null,null,null,null,null,null,null,null,null,null,null,null,"忌み嫌われし存在",null,null,"★","自","常時","自","なし","なし","なし","なし",{"$f":"\"感情強度合計値-4。〈炎〉～〈闇〉耐性+\"&5+CS!T12*2&\" 4MP以上のｽｷﾙ代償-1MP\"","v":"感情強度合計値-4。〈炎〉～〈闇〉耐性+5 4MP以上のｽｷﾙ代償-1MP"}]
[null,"キメラ祝",null,null,null,null,null,null,null,null,null,null,null,null,null,null,null,null,null,null,null,null,null,null,null,null,null,null,null,null,null,null,null,null,null,null,null,null,"祝福されし存在",null,null,"★","自","常時","自","なし","なし","なし","なし","感情強度合計値+3。常時感情ロールの出目+1。"]
[]
[null,"●クラス","選択中のクラスが水色のセルになる",null,null,null,null,null,null,null,null,null,{"$f":"\"↓CL\"&CL&\"のときのクラス特典↓\"","v":"↓CL1のときのクラス特典↓"},null,null,null,null,null,null,null,null,null,"トリプルクラス・クアドラプルクラスで取得できるスキル"]
[null,"ｸﾗｽ名","近接","射撃","回避","魔術","抵抗","敏捷","物攻","魔攻","耐久","精神","クラス特典"]
[null,"FS",2,2,2,2,1,4,4,3,26,7,{"$f":"\"命中判定のC値-1 F値+1 & 炎氷耐性+\"&CL*3","v":"命中判定のC値-1 F値+1 & 炎氷耐性+3"},null,null,null,null,null,null,null,null,null,"ファイアウォール",null,null,null,"再生の炎(ﾋｰﾙ2)"]
[null,"FC",2,2,1,2,1,2,3,4,35,8,{"$f":"\"氷水雷風土耐性+\"&CL*2&\" & 「BS：凍結」無効\"","v":"氷水雷風土耐性+2 & 「BS：凍結」無効"},null,null,null,null,null,null,null,null,null,"氷針撃",null,null,null,"アイシクルウォール",null,null,null,"アイスシールド(ﾀﾌﾈｽ3)",null,null,null,"スケーティング"]
[null,"AS",2,1,1,2,2,3,4,6,18,10,"「サブアクション」と「オートスキル」の代償-1MP (下限値：1MP)",null,null,null,null,null,null,null,null,null,"アルカナクリエイト",null,null,null,"カードセットアップ"]
[null,"WR",1,2,3,1,2,4,4,4,17,8,{"$f":"\"【敏捷】+\"&IF(CL<=5,CL,5)","v":"【敏捷】+1"},null,null,null,null,null,null,null,null,null,"ターンアウェイ",null,null,null,"癒しの風(ﾋｰﾙ2)",null,null,null,"ストームバリア",null,null,null,"エアフロート"]
[null,"BS",1,2,1,2,3,3,4,4,25,7,{"$f":"\"【耐久力】+\"&CL*5&\" & 20カウント毎に【HP】を\"&CL*3&\"点回復。\"","v":"【耐久力】+5 & 20カウント毎に【HP】を3点回復。"},null,null,null,null,null,null,null,null,null,"ブラッドカウンター",null,null,null,"ブラッドサッカー(ﾀﾌﾈｽ5)"]
[null,"VC",2,2,1,2,1,4,4,4,26,9,{"$f":"\"【精神力】+\"&CL*2&\" & 「BS：脱力(X)」無効\"","v":"【精神力】+2 & 「BS：脱力(X)」無効"},null,null,null,null,null,null,null,null,null,"虚無への誘い",null,null,null,"グラビティサポート"]
[null,"TE",2,1,1,2,2,2,4,4,30,8,{"$f":"\"「種別：支」のｽｷﾙの代償-1MP & 炎水風土属性の耐性+\"&CL*3","v":"「種別：支」のｽｷﾙの代償-1MP & 炎水風土属性の耐性+3"},null,null,null,null,null,null,null,null,null,"テトラアブソーブ",null,null,null,"テトラシールド"]
[null,"TM",2,2,2,1,3,4,4,4,20,11,"アイテムコスト-１ & バステを1D6を振って6が出たら無効にする。",null,null,null,null,null,null,null,null,null,"テレポーテーション",null,null,null,"プリパレーション"]
[null,"EE",2,2,1,1,2,3,5,5,31,8,"「BS：麻痺」無効。 1セッションに1回判定を振り直しできる。",null,null,null,null,null,null,null,null,null,"サンダーウォール"]
[null,"AB",3,3,1,2,0,3,7,4,23,9,{"$f":"\"「BS：封印」無効。【耐久力】+\"&CL*3&\" & 【精神力】+\"&CL","v":"「BS：封印」無効。【耐久力】+3 & 【精神力】+1"},null,null,null,null,null,null,null,null,null,"サポートレイ",null,null,null,"リストレイントレイ",null,null,null,"エナジーチャージ"]
[null,"BC",1,1,3,1,3,3,8,8,30,9,{"$f":"\"行動順決定時、【敏捷】+\"&10+CL&\" & ｶｳﾝﾄ開始時、後ろのｶｳﾝﾄに配置可能。\"","v":"行動順決定時、【敏捷】+11 & ｶｳﾝﾄ開始時、後ろのｶｳﾝﾄに配置可能。"},null,null,null,null,null,null,null,null,null,"連携攻撃(ｱﾀｯｸ3)",null,null,null,"アジャストメント",null,null,null,"戦術的高速発動",null,null,null,"一点集中",null,null,null,"ブラインドスポット(ｼｮｯﾄ5)"]
[null,"PD",1,1,3,1,3,2,3,3,24,12,{"$f":"\"〈近〉〈遠〉耐性+\"&CL*2&\" & 「サブアクション」のスキルの射程上限に+1する。\"","v":"〈近〉〈遠〉耐性+2 & 「サブアクション」のスキルの射程上限に+1する。"},null,null,null,null,null,null,null,null,null,"ノイズバリア",null,null,null,"ホーリーソング(ﾋｰﾙ3)",null,null,null,"ラウドスピーカー"]
[null,"AG",2,2,2,1,1,3,3,3,38,5,"「ﾒｲﾝｱｸｼｮﾝ」の代償-1MP(下限：1) 「ｽﾀｰﾄ」のｺｽﾄ-1(下限:2)",null,null,null,null,null,null,null,null,null,"アルカナストライク",null,null,null,"アルカナドロー"]
[null,"EB",3,0,2,2,1,3,2,4,28,8,"怯み・不動・麻痺・石化・KBを受けるとき、1D10で7以上なら無効"]
[null,"OK",2,2,2,2,2,2,3,3,25,10,{"$f":"\"感情使用時、HP+[(強度×5)+\"&CL*5&\"] MP+[強度]\"","v":"感情使用時、HP+[(強度×5)+5] MP+[強度]"},null,null,null,null,null,null,null,null,null,"バックフリップ(ｸｲｯｸ1)",null,null,null,"アースヒール(ﾋｰﾙ1)"]
[null,"WT",1,2,2,3,1,3,7,7,31,8,"12Cまでﾀﾞﾒｰｼﾞ受けない。 命中C値+1 & 回避C値-1(下限値16)",null,null,null,null,null,null,null,null,null,"ピンポイントガード(ﾀﾌﾈｽ3)"]
[null,"YM",2,2,1,2,2,3,2,2,27,9,{"$f":"\"光闇耐性+\"&CL*2&\" & 常時F値-1(下限値4)\"","v":"光闇耐性+2 & 常時F値-1(下限値4)"},null,null,null,null,null,null,null,null,null,"急々如律令"]
[null,"TD",1,2,2,3,1,4,3,4,24,10,"回避判定のC値-1(下限値16)",null,null,null,null,null,null,null,null,null,"時間遡行",null,null,null,"タイムバインド"]
[null,"CR",2,2,1,2,1,3,4,4,20,8,{"$f":"\"「BS：呪い」「BS：疲労」無効 & 〈炎〉～〈闇〉耐性+\"&CL+2","v":"「BS：呪い」「BS：疲労」無効 & 〈炎〉～〈闇〉耐性+3"},null,null,null,null,null,null,null,null,null,"オールランダム",null,null,null,"ランダムテレポート"]
[null,"MV",1,2,1,2,3,5,1,1,17,11,{"$f":"\"BS付与するとき、代わりに\"&CL+8&\"点の〈無〉属性ﾀﾞﾒｰｼﾞを与えてもよい。\"","v":"BS付与するとき、代わりに9点の〈無〉属性ﾀﾞﾒｰｼﾞを与えてもよい。"},null,null,null,null,null,null,null,null,null,"ハルシネーション",null,null,null,"スターゲイジング",null,null,null,"オーラルブレイク"]
[null,"TA",2,2,3,2,0,2,4,3,20,8,"ｻﾌﾞｱｸｼｮﾝでｱｲﾃﾑを使用した場合でも、ｻﾌﾞｱｸｼｮﾝのｽｷﾙ使用可。",null,null,null,null,null,null,null,null,null,"アイテムセットアップ"]
[null,"LS",1,3,1,2,1,2,5,3,29,7,"自身の攻撃前に1D10を振り、出目が3か4なら攻撃対象の全耐性0。",null,null,null,null,null,null,null,null,null,"レーザーバリア"]
[null,"BR",2,0,2,2,2,4,7,7,23,10,{"$f":"\"「射程：0-1」の範囲内の対象から受けるダメージ-\"&CL*3+10","v":"「射程：0-1」の範囲内の対象から受けるダメージ-13"}]
[null,"SN",2,2,2,2,0,3,5,5,15,12,"攻撃を回避したとき、【MP】を1D6点回復する。",null,null,null,null,null,null,null,null,null,"手裏剣術(ｼｮｯﾄ4)"]
[null,"CP",2,1,1,2,2,1,4,4,14,14,"20の倍数ｶｳﾝﾄ終了時、あなたのいるﾏｽに「ﾄﾞｰﾙ」を1体配置する。"]
[null,"SA",2,2,2,1,2,3,5,3,19,9,"10の倍数Cごとに、【MP】を[X/2](↓)点回復。X=[現C/10]"]
[null,"FM",0,0,3,3,3,5,0,10,0,15,{"$f":"\"【耐久力】-\"&(CL+1)*10&\" 感情強度合計値-2\"","v":"【耐久力】-20 感情強度合計値-2"}]
[null,"BD",2,0,2,2,3,2,5,5,18,10,"5の倍数ｶｳﾝﾄ開始時、4MP ｺｽﾄ0で[ﾊﾞﾘｱ状態]の付与,解除可能。",null,null,null,null,null,null,null,null,null,"シーンウォール(ﾀﾌﾈｽ3)"]
[null,"ER",2,2,1,2,1,4,6,6,27,8,"幻獣が存在する間、判定のC値-1、F値+3。(C値下限16 F値上限9)",null,null,null,null,null,null,null,null,null,"アイドロンガード"]
[null,"PP",1,2,1,2,3,3,4,7,20,12,"「BS：怯み(X)」のXに-1(下限値：1) 「BS：毒(X)」無効。",null,null,null,null,null,null,null,null,null,"ポイズンフラッド"]
[null,"AW",2,2,2,2,2,4,5,5,8,8,{"$f":"\"1C開始～13C終了間MP代償無視。 & 〈炎〉〈雷〉〈闇〉耐性+\"&CL*3","v":"1C開始～13C終了間MP代償無視。 & 〈炎〉〈雷〉〈闇〉耐性+3"}]
[null,"WP",1,2,2,2,2,3,5,6,27,7,"現在のカウントが偶数の場合、全判定の達成値+1",null,null,null,null,null,null,null,null,null,"大旱魃",null,null,null,"降雪術",null,null,null,"テイルウィンド",null,null,null,"瞬雷電"]
[null,"IA",3,2,2,0,2,4,5,3,30,7,{"$f":"\"ｽｷﾙによって武器変更される時、【HP】+\"&ROUNDDOWN(CS!AE12/7,0) &\" 【MP】+\"&2","v":{"$error":"#VALUE!"}},null,null,null,null,null,null,null,null,null,"ブレイバー",null,null,null,"制限解除",null,null,null,"アームズガード"]
[null,"VM",1,1,2,3,2,2,3,7,5,13,"「種別：回」のｽｷﾙ効果で自身のHPが回復したとき、1ﾏｽ移動可能",null,null,null,null,null,null,null,null,null,"クイックリペアー"]
[null,"SF",2,2,1,2,1,1,7,7,32,10,"1ｾｯｼｮﾝ1回、あなたへのBS付与を無効にする。",null,null,null,null,null,null,null,null,null,"八卦の陣"]
[null,"DP",2,2,1,2,2,2,6,3,21,9,"1戦闘1回、判定達成値に+15する。その後、「BS：眠り」となる。",null,null,null,null,null,null,null,null,null,"夢世界の住人",null,null,null,"ヒュプノガス"]
[null,"ZP",1,1,3,1,3,2,6,6,8,14,"｢ﾒｲﾝｱｸｼｮﾝ」のｽｷﾙｺｽﾄ+1 自身以外のｽｷﾙ射程+1",null,null,null,null,null,null,null,null,null,"クロスエンパシー",null,null,null,"レビテーション",null,null,null,"飛空刃(ｱﾀｯｸ2)",null,null,null,"ｴﾅｼﾞｰｼｰﾙﾄﾞ(ﾒﾝﾀﾙ3)"]
[null,"CI",3,1,2,1,2,4,7,3,35,6,"最前列にいる時 全達成値+1 それ以外のﾏｽの時 全達成値-1"]
[null,"MA",2,3,1,1,1,2,5,5,25,6,{"$f":"\"開始時 機械ｱｲﾃﾑR2回 近遠炎風 耐性+\"&CL*6&\" 氷水雷土耐性-\"&CL*6","v":"開始時 機械ｱｲﾃﾑR2回 近遠炎風 耐性+6 氷水雷土耐性-6"},null,null,null,null,null,null,null,null,null,"マシンガンタレット",null,null,null,"リペアドローン",null,null,null,"メガバスター",null,null,null,"フルオートストーム"]
[null,"IS",2,2,3,2,1,1,3,3,40,4,{"$f":"\"[準備期間]中、被D\"&CL*5+10&\"点軽減 「種別：支」のｻﾌﾞｽｷﾙでｻﾌﾞ消費なし\"","v":"[準備期間]中、被D15点軽減 「種別：支」のｻﾌﾞｽｷﾙでｻﾌﾞ消費なし"},null,null,null,null,null,null,null,null,null,"チャージフリーズ",null,null,null,"チャージスパーク",null,null,null,"チャージシールド"]
[null,"LA",1,1,1,1,1,2,2,2,18,8,"戦闘中の判定で出目7ならクリティカルになる",null,null,null,null,null,null,null,null,null,"ラッキーアロー",null,null,null,"不幸の星",null,null,null,"不幸中の幸い"]
[null,"MW",2,2,2,2,2,2,3,3,20,10,"1戦闘1回、「ﾒｲﾝｱｸｼｮﾝ」ｽｷﾙをコスト9で使用可能",null,null,null,null,null,null,null,null,null,"コーティングエッジ",null,null,null,"アロイブレード",null,null,null,"シルバーバレット",null,null,null,"マグネットドロー"]

{"sheet":"クリアボタン","index":3,"n_rows":7,"n_cols":8,"rows_kept":7,"cut":false,"hidden":false,"merged":[[1,1,2,6],[3,1,5,4],[6,1,8,4],[1,7,2,9],[3,7,5,9],[6,7,8,9]]}
[]
[null,"クリアボタン(マクロ)",null,null,null,null,null,"ショートカットキー"]
[]
[null,"オールリセット",null,null,null,null,null,"Ctrl+Shift+R"]
[]
[]
[null,"スキル欄オールクリア",null,null,null,null,null,"Ctrl+Shift+S"]

{"sheet":"atwiki","index":4,"n_rows":83,"n_cols":1,"rows_kept":83,"cut":false,"hidden":false,"merged":[]}
[{"$f":"\"|キャラクター名|\"&CS!V4&\"|\"","v":"|キャラクター名||"}]
[{"$f":"\"|キャラクターレベル|\"&CL&\"|\"","v":"|キャラクターレベル|1|"}]
[{"$f":"\"|種族|\"&種族名&\"|\"","v":"|種族|人間|"}]
[{"$f":"\"|クラス|\"&クラスA&\"/\"&クラスB&\"|\"","v":"|クラス|FS/FC|"}]
[]
["|>|パーソナルデータ|"]
[{"$f":"\"|理由|\"&CS!AU4&\"|\"","v":"|理由||"}]
[{"$f":"\"|職業|\"&CS!AU6&\"|\"","v":"|職業||"}]
[{"$f":"\"|宝物|\"&CS!AU8&\"|\"","v":"|宝物||"}]
[]
["|>|>|>|>|基本能力値|"]
["|肉体|集中|反射|知識|幸運|"]
[{"$f":"\"|\"&CS!B18&\"|\"&CS!E18&\"|\"&CS!H18&\"|\"&CS!K18&\"|\"&CS!N18&\"|\"","v":"||||||"}]
[]
["&bold(){装備}"]
["|>|>|>|>|>|装備|効果|消費額|"]
[{"$f":"\"|武器|\"&武器名&IF(SL=\"\",\"\",\" (SL\"&SL&\") \")&\"|種別：\"&CS!AJ16&\"|射程：\"&CS!V18&\"|コスト：\"&CS!AC18&\"|属性：\"&CS!AJ18&\"|\"&CS!V19&\"|\"&VLOOKUP(武器名,VL用!$AM$55:$BN$552,28,FALSE)&\"ND|\"","v":"|武器|素手|種別：近接|射程：0-1|コスト：9|属性：近|効果なし|0ND|"}]
[{"$f":"\"|防具|>|>|>|>|>|\"&防具名&\"|\"&VLOOKUP(防具名,VL用!$BO$55:$CL$506,24,FALSE)&\"ND|\"","v":"|防具|>|>|>|>|>|一般服|0ND|"}]
[{"$f":"\"|ｱｸｾｻﾘｰA|>|>|>|>|\"&アクセA&\"|\"&VLOOKUP(アクセA,VL用!$CM$54:$DL$220,26,)&\"|\"&VLOOKUP(アクセA,VL用!$CM$55:$DJ$515,24,FALSE)&\"ND|\"","v":"|ｱｸｾｻﾘｰA|>|>|>|>|なし||0ND|"}]
[{"$f":"\"|ｱｸｾｻﾘｰB|>|>|>|>|\"&アクセB&\"|\"&VLOOKUP(アクセB,VL用!$CM$54:$DL$220,26,)&\"|\"&VLOOKUP(アクセB,VL用!$CM$55:$DJ$515,24,FALSE)&\"ND|\"","v":"|ｱｸｾｻﾘｰB|>|>|>|>|なし||0ND|"}]
[{"$f":"\"|ｱｸｾｻﾘｰC|>|>|>|>|\"&アクセC&\"|\"&VLOOKUP(アクセC,VL用!$CM$54:$DL$220,26,)&\"|\"&VLOOKUP(アクセC,VL用!$CM$55:$DJ$515,24,FALSE)&\"ND|\"","v":"|ｱｸｾｻﾘｰC|>|>|>|>|なし||0ND|"}]
[{"$f":"\"|>|>|>|>|>|>|消費額|\"&CS!BE19&\"ND|\"","v":"|>|>|>|>|>|>|消費額|0ND|"}]
[]
["&bold(){戦闘能力値}"]
["|＼|種族|クラス|武器|防具|アクセA|アクセB|アクセC|他修正|合計|"]
[{"$f":"\"|近接|\"&CS!F25&\"|\"&CS!I25&\"|\"&CS!L25&\"|\"&CS!O25&\"|\"&CS!R25&\"|\"&CS!T25&\"|\"&CS!V25&\"|\"&CS!X25&\"|\"&CS!AI25&\"|\"","v":"|近接|5|4|-2||||||7|"}]
[{"$f":"\"|射撃|\"&CS!F27&\"|\"&CS!I27&\"|\"&CS!L27&\"|\"&CS!O27&\"|\"&CS!R27&\"|\"&CS!T27&\"|\"&CS!V27&\"|\"&CS!X27&\"|\"&CS!AI27&\"|\"","v":"|射撃|5|4|||||||9|"}]
[{"$f":"\"|回避|\"&CS!F29&\"|\"&CS!I29&\"|\"&CS!L29&\"|\"&CS!O29&\"|\"&CS!R29&\"|\"&CS!T29&\"|\"&CS!V29&\"|\"&CS!X29&\"|\"&CS!AI29&\"|\"","v":"|回避|3|3|||||||6|"}]
[{"$f":"\"|魔術|\"&CS!F31&\"|\"&CS!I31&\"|\"&CS!L31&\"|\"&CS!O31&\"|\"&CS!R31&\"|\"&CS!T31&\"|\"&CS!V31&\"|\"&CS!X31&\"|\"&CS!AI31&\"|\"","v":"|魔術|4|4|||||||8|"}]
[{"$f":"\"|抵抗|\"&CS!F33&\"|\"&CS!I33&\"|\"&CS!L33&\"|\"&CS!O33&\"|\"&CS!R33&\"|\"&CS!T33&\"|\"&CS!V33&\"|\"&CS!X33&\"|\"&CS!AI33&\"|\"","v":"|抵抗|3|2|||||||5|"}]
[{"$f":"\"|敏捷|\"&CS!F35&\"|\"&CS!I35&\"|\"&CS!L35&\"|\"&CS!O35&\"|\"&CS!R35&\"|\"&CS!T35&\"|\"&CS!V35&\"|\"&CS!X35&\"|\"&CS!AI35&\"|\"","v":"|敏捷|4|6|1||||||11|"}]
[{"$f":"\"|物攻|\"&CS!F37&\"|\"&CS!I37&\"|\"&CS!L37&\"|\"&CS!O37&\"|\"&CS!R37&\"|\"&CS!T37&\"|\"&CS!V37&\"|\"&CS!X37&\"|\"&CS!AI37&\"|\"","v":"|物攻|10|7|16||||||33|"}]
[{"$f":"\"|魔攻|\"&CS!F39&\"|\"&CS!I39&\"|\"&CS!L39&\"|\"&CS!O39&\"|\"&CS!R39&\"|\"&CS!T39&\"|\"&CS!V39&\"|\"&CS!X39&\"|\"&CS!AI39&\"|\"","v":"|魔攻|10|7|||||||17|"}]
[{"$f":"\"|耐久力|\"&CS!F41&\"|\"&CS!I41&\"|\"&CS!L41&\"|\"&CS!O41&\"|\"&CS!R41&\"|\"&CS!T41&\"|\"&CS!V41&\"|\"&CS!X41&\"|\"&CS!AI41&\"|\"","v":"|耐久力|100|61|||||||161|"}]
[{"$f":"\"|精神力|\"&CS!F43&\"|\"&CS!I43&\"|\"&CS!L43&\"|\"&CS!O43&\"|\"&CS!R43&\"|\"&CS!T43&\"|\"&CS!V43&\"|\"&CS!X43&\"|\"&CS!AI43&\"|\"","v":"|精神力|30|15|||||||45|"}]
[{"$f":"\"|近耐性|\"&CS!F45&\"|\"&CS!I45&\"|\"&CS!L45&\"|\"&CS!O45&\"|\"&CS!R45&\"|\"&CS!T45&\"|\"&CS!V45&\"|\"&CS!X45&\"|\"&CS!AI45&\"|\"","v":"|近耐性|10||-7|-10|||||-7|"}]
[{"$f":"\"|遠耐性|\"&CS!F46&\"|\"&CS!I46&\"|\"&CS!L46&\"|\"&CS!O46&\"|\"&CS!R46&\"|\"&CS!T46&\"|\"&CS!V46&\"|\"&CS!X46&\"|\"&CS!AI46&\"|\"","v":"|遠耐性|10||-7|-10|||||-7|"}]
[{"$f":"\"|炎耐性|\"&CS!F47&\"|\"&CS!I47&\"|\"&CS!L47&\"|\"&CS!O47&\"|\"&CS!R47&\"|\"&CS!T47&\"|\"&CS!V47&\"|\"&CS!X47&\"|\"&CS!AI47&\"|\"","v":"|炎耐性|0|3||-10|||||-7|"}]
[{"$f":"\"|氷耐性|\"&CS!F48&\"|\"&CS!I48&\"|\"&CS!L48&\"|\"&CS!O48&\"|\"&CS!R48&\"|\"&CS!T48&\"|\"&CS!V48&\"|\"&CS!X48&\"|\"&CS!AI48&\"|\"","v":"|氷耐性|0|5||-10|||||-5|"}]
[{"$f":"\"|水耐性|\"&CS!F49&\"|\"&CS!I49&\"|\"&CS!L49&\"|\"&CS!O49&\"|\"&CS!R49&\"|\"&CS!T49&\"|\"&CS!V49&\"|\"&CS!X49&\"|\"&CS!AI49&\"|\"","v":"|水耐性|-5|2||-10|||||-13|"}]
[{"$f":"\"|雷耐性|\"&CS!F50&\"|\"&CS!I50&\"|\"&CS!L50&\"|\"&CS!O50&\"|\"&CS!R50&\"|\"&CS!T50&\"|\"&CS!V50&\"|\"&CS!X50&\"|\"&CS!AI50&\"|\"","v":"|雷耐性|0|2||-10|||||-8|"}]
[{"$f":"\"|風耐性|\"&CS!F51&\"|\"&CS!I51&\"|\"&CS!L51&\"|\"&CS!O51&\"|\"&CS!R51&\"|\"&CS!T51&\"|\"&CS!V51&\"|\"&CS!X51&\"|\"&CS!AI51&\"|\"","v":"|風耐性|5|2||-10|||||-3|"}]
[{"$f":"\"|土耐性|\"&CS!F52&\"|\"&CS!I52&\"|\"&CS!L52&\"|\"&CS!O52&\"|\"&CS!R52&\"|\"&CS!T52&\"|\"&CS!V52&\"|\"&CS!X52&\"|\"&CS!AI52&\"|\"","v":"|土耐性|2|2||-10|||||-6|"}]
[{"$f":"\"|光耐性|\"&CS!F53&\"|\"&CS!I53&\"|\"&CS!L53&\"|\"&CS!O53&\"|\"&CS!R53&\"|\"&CS!T53&\"|\"&CS!V53&\"|\"&CS!X53&\"|\"&CS!AI53&\"|\"","v":"|光耐性|4|||-10|||||-6|"}]
[{"$f":"\"|闇耐性|\"&CS!F54&\"|\"&CS!I54&\"|\"&CS!L54&\"|\"&CS!O54&\"|\"&CS!R54&\"|\"&CS!T54&\"|\"&CS!V54&\"|\"&CS!X54&\"|\"&CS!AI54&\"|\"","v":"|闇耐性|3|||-10|||||-7|"}]
[]
[{"$f":"\"|命中C値|\"&CS!AV13&\"|命中F値|\"&CS!BE13&\"|\"","v":"|命中C値|18|命中F値|5|"}]
[{"$f":"\"|回避C値|\"&CS!AV15&\"|回避F値|\"&CS!BE15&\"|\"","v":"|回避C値|18|回避F値|5|"}]
[{"$f":"\"|調査C値|\"&CS!AV17&\"|調査F値|\"&CS!BE17&\"|\"","v":"|調査C値|18|調査F値|5|"}]
[{"$f":"\"|>|>|移動コスト|\"&CS!AV19&\"|\"","v":"|>|>|移動コスト|3/8|"}]
[]
["&bold(){種族・クラス特典}"]
[{"$f":"\"|種族特典|\"&CS!AQ26&\"|\"","v":"|種族特典|常時C値-1(下限値16) & 集中判定を1度振り直せる。|"}]
[{"$f":"\"|クラス特典A|\"&CS!BE26&\"|\"","v":"|クラス特典A|命中判定のC値-1 F値+1 & 炎氷耐性+3|"}]
[{"$f":"\"|クラス特典B|\"&CS!BQ26&\"|\"","v":"|クラス特典B|氷水雷風土耐性+2 & 「BS：凍結」無効|"}]
[]
["&bold(){スキルデータ}"]
["||スキル名|SL|種別|タイミング|対象|射程|判定値|代償|コスト|効果|"]
[{"$f":"\"|自|\"&INDIRECT(\"CS!AR30\")&\"|\"&INDIRECT(\"CS!AY30\")&\"|\"&INDIRECT(\"CS!BA30\")&\"|\"&INDIRECT(\"CS!BC30\")&\"|\"&INDIRECT(\"CS!BF30\")&\"|\"&INDIRECT(\"CS!BH30\")&\"|\"&INDIRECT(\"CS!BJ30\")&\"|\"&INDIRECT(\"CS!BM30\")&\"|\"&INDIRECT(\"CS!BO30\")&\"|\"&INDIRECT(\"CS!BR30\")&\"|\"","v":"|自|起死回生|★|自|ｵｰﾄ|自|なし|自動|6BP|0|判定直後ダイス目を両方9にする。対抗判定のC値が20固定。戦闘外では-2BP。|"}]
[{"$f":"\"|1|\"&INDIRECT(\"CS!AR32\")&\"|\"&INDIRECT(\"CS!AY32\")&\"|\"&INDIRECT(\"CS!BA32\")&\"|\"&INDIRECT(\"CS!BC32\")&\"|\"&INDIRECT(\"CS!BF32\")&\"|\"&INDIRECT(\"CS!BH32\")&\"|\"&INDIRECT(\"CS!BJ32\")&\"|\"&INDIRECT(\"CS!BM32\")&\"|\"&INDIRECT(\"CS!BO32\")&\"|\"&INDIRECT(\"CS!BR32\")&\"|\"","v":"|1|||||||||||"}]
[{"$f":"\"|1|\"&INDIRECT(\"CS!AR34\")&\"|\"&INDIRECT(\"CS!AY34\")&\"|\"&INDIRECT(\"CS!BA34\")&\"|\"&INDIRECT(\"CS!BC34\")&\"|\"&INDIRECT(\"CS!BF34\")&\"|\"&INDIRECT(\"CS!BH34\")&\"|\"&INDIRECT(\"CS!BJ34\")&\"|\"&INDIRECT(\"CS!BM34\")&\"|\"&INDIRECT(\"CS!BO34\")&\"|\"&INDIRECT(\"CS!BR34\")&\"|\"","v":"|1|||||||||||"}]
[{"$f":"\"|1|\"&INDIRECT(\"CS!AR36\")&\"|\"&INDIRECT(\"CS!AY36\")&\"|\"&INDIRECT(\"CS!BA36\")&\"|\"&INDIRECT(\"CS!BC36\")&\"|\"&INDIRECT(\"CS!BF36\")&\"|\"&INDIRECT(\"CS!BH36\")&\"|\"&INDIRECT(\"CS!BJ36\")&\"|\"&INDIRECT(\"CS!BM36\")&\"|\"&INDIRECT(\"CS!BO36\")&\"|\"&INDIRECT(\"CS!BR36\")&\"|\"","v":"|1|||||||||||"}]
[{"$f":"\"|1|\"&INDIRECT(\"CS!AR38\")&\"|\"&INDIRECT(\"CS!AY38\")&\"|\"&INDIRECT(\"CS!BA38\")&\"|\"&INDIRECT(\"CS!BC38\")&\"|\"&INDIRECT(\"CS!BF38\")&\"|\"&INDIRECT(\"CS!BH38\")&\"|\"&INDIRECT(\"CS!BJ38\")&\"|\"&INDIRECT(\"CS!BM38\")&\"|\"&INDIRECT(\"CS!BO38\")&\"|\"&INDIRECT(\"CS!BR38\")&\"|\"","v":"|1|||||||||||"}]
[{"$f":"\"|1|\"&INDIRECT(\"CS!AR40\")&\"|\"&INDIRECT(\"CS!AY40\")&\"|\"&INDIRECT(\"CS!BA40\")&\"|\"&INDIRECT(\"CS!BC40\")&\"|\"&INDIRECT(\"CS!BF40\")&\"|\"&INDIRECT(\"CS!BH40\")&\"|\"&INDIRECT(\"CS!BJ40\")&\"|\"&INDIRECT(\"CS!BM40\")&\"|\"&INDIRECT(\"CS!BO40\")&\"|\"&INDIRECT(\"CS!BR40\")&\"|\"","v":"|1|||||||||||"}]
[{"$f":"\"|1|\"&INDIRECT(\"CS!AR42\")&\"|\"&INDIRECT(\"CS!AY42\")&\"|\"&INDIRECT(\"CS!BA42\")&\"|\"&INDIRECT(\"CS!BC42\")&\"|\"&INDIRECT(\"CS!BF42\")&\"|\"&INDIRECT(\"CS!BH42\")&\"|\"&INDIRECT(\"CS!BJ42\")&\"|\"&INDIRECT(\"CS!BM42\")&\"|\"&INDIRECT(\"CS!BO42\")&\"|\"&INDIRECT(\"CS!BR42\")&\"|\"","v":"|1|||||||||||"}]
[{"$f":"\"|2|\"&INDIRECT(\"CS!AR44\")&\"|\"&INDIRECT(\"CS!AY44\")&\"|\"&INDIRECT(\"CS!BA44\")&\"|\"&INDIRECT(\"CS!BC44\")&\"|\"&INDIRECT(\"CS!BF44\")&\"|\"&INDIRECT(\"CS!BH44\")&\"|\"&INDIRECT(\"CS!BJ44\")&\"|\"&INDIRECT(\"CS!BM44\")&\"|\"&INDIRECT(\"CS!BO44\")&\"|\"&INDIRECT(\"CS!BR44\")&\"|\"","v":"|2|||||||||||"}]
[{"$f":"\"|3|\"&INDIRECT(\"CS!AR46\")&\"|\"&INDIRECT(\"CS!AY46\")&\"|\"&INDIRECT(\"CS!BA46\")&\"|\"&INDIRECT(\"CS!BC46\")&\"|\"&INDIRECT(\"CS!BF46\")&\"|\"&INDIRECT(\"CS!BH46\")&\"|\"&INDIRECT(\"CS!BJ46\")&\"|\"&INDIRECT(\"CS!BM46\")&\"|\"&INDIRECT(\"CS!BO46\")&\"|\"&INDIRECT(\"CS!BR46\")&\"|\"","v":"|3|||||||||||"}]
[{"$f":"\"|4|\"&INDIRECT(\"CS!AR48\")&\"|\"&INDIRECT(\"CS!AY48\")&\"|\"&INDIRECT(\"CS!BA48\")&\"|\"&INDIRECT(\"CS!BC48\")&\"|\"&INDIRECT(\"CS!BF48\")&\"|\"&INDIRECT(\"CS!BH48\")&\"|\"&INDIRECT(\"CS!BJ48\")&\"|\"&INDIRECT(\"CS!BM48\")&\"|\"&INDIRECT(\"CS!BO48\")&\"|\"&INDIRECT(\"CS!BR48\")&\"|\"","v":"|4|||||||||||"}]
[{"$f":"\"|5|\"&INDIRECT(\"CS!AR50\")&\"|\"&INDIRECT(\"CS!AY50\")&\"|\"&INDIRECT(\"CS!BA50\")&\"|\"&INDIRECT(\"CS!BC50\")&\"|\"&INDIRECT(\"CS!BF50\")&\"|\"&INDIRECT(\"CS!BH50\")&\"|\"&INDIRECT(\"CS!BJ50\")&\"|\"&INDIRECT(\"CS!BM50\")&\"|\"&INDIRECT(\"CS!BO50\")&\"|\"&INDIRECT(\"CS!BR50\")&\"|\"","v":"|5|||||||||||"}]
[{"$f":"\"|7|\"&INDIRECT(\"CS!AR52\")&\"|\"&INDIRECT(\"CS!AY52\")&\"|\"&INDIRECT(\"CS!BA52\")&\"|\"&INDIRECT(\"CS!BC52\")&\"|\"&INDIRECT(\"CS!BF52\")&\"|\"&INDIRECT(\"CS!BH52\")&\"|\"&INDIRECT(\"CS!BJ52\")&\"|\"&INDIRECT(\"CS!BM52\")&\"|\"&INDIRECT(\"CS!BO52\")&\"|\"&INDIRECT(\"CS!BR52\")&\"|\"","v":"|7|||||||||||"}]
[{"$f":"\"|9|\"&INDIRECT(\"CS!AR54\")&\"|\"&INDIRECT(\"CS!AY54\")&\"|\"&INDIRECT(\"CS!BA54\")&\"|\"&INDIRECT(\"CS!BC54\")&\"|\"&INDIRECT(\"CS!BF54\")&\"|\"&INDIRECT(\"CS!BH54\")&\"|\"&INDIRECT(\"CS!BJ54\")&\"|\"&INDIRECT(\"CS!BM54\")&\"|\"&INDIRECT(\"CS!BO54\")&\"|\"&INDIRECT(\"CS!BR54\")&\"|\"","v":"|9|||||||||||"}]
[]
["&bold(){消費アイテムデータ}"]
["|アイテム名|個数|"]
[{"$f":"IF(INDIRECT(\"CS!BK17\")=\"\",\"\",\"|\"&INDIRECT(\"CS!BK17\")&\"|\"&INDIRECT(\"CS!BS17\")&\"|\")","v":"|所持品||"}]
[{"$f":"IF(INDIRECT(\"CS!BK18\")=\"\",\"\",\"|\"&INDIRECT(\"CS!BK18\")&\"|\"&INDIRECT(\"CS!BS18\")&\"|\")","v":""}]
[{"$f":"IF(INDIRECT(\"CS!BK19\")=\"\",\"\",\"|\"&INDIRECT(\"CS!BK19\")&\"|\"&INDIRECT(\"CS!BS19\")&\"|\")","v":""}]
[{"$f":"IF(INDIRECT(\"CS!BK20\")=\"\",\"\",\"|\"&INDIRECT(\"CS!BK20\")&\"|\"&INDIRECT(\"CS!BS20\")&\"|\")","v":""}]
[{"$f":"IF(INDIRECT(\"CS!BK21\")=\"\",\"\",\"|\"&INDIRECT(\"CS!BK21\")&\"|\"&INDIRECT(\"CS!BS21\")&\"|\")","v":""}]
[{"$f":"IF(INDIRECT(\"CS!BT18\")=\"\",\"\",\"|\"&INDIRECT(\"CS!BT18\")&\"|\"&INDIRECT(\"CS!BU18\")&\"|\")","v":""}]
[{"$f":"IF(INDIRECT(\"CS!BT19\")=\"\",\"\",\"|\"&INDIRECT(\"CS!BT19\")&\"|\"&INDIRECT(\"CS!BU19\")&\"|\")","v":""}]
[{"$f":"IF(INDIRECT(\"CS!BT20\")=\"\",\"\",\"|\"&INDIRECT(\"CS!BT20\")&\"|\"&INDIRECT(\"CS!BU20\")&\"|\")","v":""}]
[{"$f":"IF(INDIRECT(\"CS!BT21\")=\"\",\"\",\"|\"&INDIRECT(\"CS!BT21\")&\"|\"&INDIRECT(\"CS!BU21\")&\"|\")","v":""}]

{"sheet":"VL用","index":5,"n_rows":240,"n_cols":215,"rows_kept":240,"cut":false,"hidden":false,"merged":[[159,38,159,40],[160,38,160,40],[161,38,161,40],[162,38,162,40],[163,38,163,40],[164,38,164,40],[165,38,165,40],[150,38,150,40],[141,38,141,40],[142,38,142,40],[145,38,145,40],[148,38,148,40],[146,38,146,40],[147,38,147,40],[92,66,92,68],[93,66,93,68],[94,66,94,68],[95,66,95,68],[198,90,198,92],[199,90,199,92],[200,90,200,92],[235,38,235,40],[156,38,156,40],[157,38,157,40],[143,38,143,40],[144,38,144,40],[136,38,136,40],[137,38,137,40],[176,38,176,40],[204,38,204,40],[202,38,202,40],[206,38,206,40],[181,38,181,40],[186,38,186,40],[187,38,187,40],[188,38,188,40],[180,38,180,40],[168,38,168,40],[236,38,236,40],[188,90,188,92],[179,90,179,92],[180,90,180,92],[181,90,181,92],[182,90,182,92],[183,90,183,92],[184,90,184,92],[185,90,185,92],[186,90,186,92],[187,90,187,92],[224,38,224,40],[223,38,223,40],[233,38,233,40],[234,38,234,40],[230,38,230,40],[231,38,231,40],[232,38,232,40],[228,38,228,40],[197,38,197,40],[210,38,210,40],[194,38,194,40],[205,38,205,40],[203,38,203,40],[222,38,222,40],[195,90,195,92],[196,90,196,92],[108,90,108,92],[107,90,107,92],[132,38,132,40],[115,38,115,40],[116,38,116,40],[117,38,117,40],[118,38,118,40],[110,38,110,40],[111,38,111,40],[112,38,112,40],[113,38,113,40],[114,38,114,40],[155,90,155,92],[107,38,107,40],[169,38,169,40],[170,38,170,40],[119,38,119,40],[120,38,120,40],[121,38,121,40],[122,38,122,40],[130,38,130,40],[158,90,158,92],[149,90,149,92],[150,90,150,92],[152,90,152,92],[167,38,167,40],[200,38,200,40],[207,38,207,40],[208,38,208,40],[183,38,183,40],[179,38,179,40],[190,38,190,40],[166,38,166,40],[177,38,177,40],[173,38,173,40],[189,38,189,40],[172,38,172,40],[154,38,154,40],[155,38,155,40],[149,38,149,40],[178,38,178,40],[192,38,192,40],[182,38,182,40],[174,38,174,40],[175,38,175,40],[171,38,171,40],[76,38,76,40],[77,38,77,40],[78,38,78,40],[79,38,79,40],[73,38,73,40],[74,38,74,40],[75,38,75,40],[84,26,84,35],[85,26,85,35],[86,26,86,35],[87,26,87,35],[88,26,88,35],[89,26,89,35],[105,38,105,40],[133,38,133,40],[134,38,134,40],[158,38,158,40],[108,38,108,40],[109,38,109,40],[151,38,151,40],[152,38,152,40],[153,38,153,40],[106,38,106,40],[135,38,135,40],[109,90,109,92],[124,90,124,92],[125,90,125,92],[126,90,126,92],[127,90,127,92],[123,90,123,92],[115,90,115,92],[123,38,123,40],[124,38,124,40],[125,38,125,40],[126,38,126,40],[127,38,127,40],[110,90,110,92],[111,90,111,92],[113,90,113,92],[112,90,112,92],[131,38,131,40],[138,38,138,40],[139,38,139,40],[140,38,140,40],[128,38,128,40],[129,38,129,40],[163,90,163,92],[114,90,114,92],[116,90,116,92],[117,90,117,92],[118,90,118,92],[160,90,160,92],[161,90,161,92],[162,90,162,92],[159,90,159,92],[136,90,136,92],[137,90,137,92],[138,90,138,92],[139,90,139,92],[140,90,140,92],[144,90,144,92],[145,90,145,92],[147,90,147,92],[141,90,141,92],[135,90,135,92],[142,90,142,92],[143,90,143,92],[148,90,148,92],[151,90,151,92],[146,90,146,92],[154,90,154,92],[106,90,106,92],[87,90,87,92],[88,90,88,92],[153,90,153,92],[133,90,133,92],[134,90,134,92],[128,90,128,92],[129,90,129,92],[130,90,130,92],[131,90,131,92],[132,90,132,92],[82,90,82,92],[79,90,79,92],[80,90,80,92],[178,90,178,92],[89,90,89,92],[90,90,90,92],[91,90,91,92],[92,90,92,92],[93,90,93,92],[94,90,94,92],[96,90,96,92],[97,90,97,92],[98,90,98,92],[99,90,99,92],[100,90,100,92],[101,90,101,92],[102,90,102,92],[119,90,119,92],[120,90,120,92],[121,90,121,92],[122,90,122,92],[105,90,105,92],[95,90,95,92],[156,90,156,92],[76,90,76,92],[77,90,77,92],[78,90,78,92],[68,90,68,92],[70,90,70,92],[71,90,71,92],[72,90,72,92],[73,90,73,92],[74,90,74,92],[69,90,69,92],[100,38,100,40],[101,38,101,40],[102,38,102,40],[103,38,103,40],[94,38,94,40],[95,38,95,40],[85,66,85,68],[70,66,70,68],[104,90,104,92],[104,38,104,40],[83,66,83,68],[77,66,77,68],[83,38,83,40],[84,38,84,40],[85,38,85,40],[86,38,86,40],[87,38,87,40],[88,38,88,40],[86,66,86,68],[87,66,87,68],[88,66,88,68],[89,66,89,68],[90,66,90,68],[91,66,91,68],[96,38,96,40],[97,38,97,40],[99,38,99,40],[89,38,89,40],[90,38,90,40],[91,38,91,40],[92,38,92,40],[72,26,72,35],[81,26,81,35],[78,26,78,35],[93,38,93,40],[98,38,98,40],[80,26,80,35],[80,38,80,40],[81,38,81,40],[82,38,82,40],[73,26,73,35],[74,26,74,35],[83,26,83,35],[84,66,84,68],[82,66,82,68],[58,2,58,4],[67,66,67,68],[79,26,79,35],[60,66,60,68],[61,66,61,68],[62,66,62,68],[63,66,63,68],[64,66,64,68],[65,66,65,68],[66,66,66,68],[69,26,69,35],[64,26,64,35],[67,26,67,35],[76,26,76,35],[77,26,77,35],[75,26,75,35],[78,66,78,68],[82,26,82,35],[81,66,81,68],[79,66,79,68],[75,66,75,68],[76,66,76,68],[51,195,51,214],[51,6,51,25],[51,27,51,46],[51,48,51,67],[51,69,51,88],[51,90,51,109],[51,111,51,130],[51,132,51,151],[51,174,51,193],[68,66,68,68],[69,66,69,68],[71,66,71,68],[72,66,72,68],[73,66,73,68],[74,66,74,68],[68,38,68,40],[69,38,69,40],[70,38,70,40],[80,66,80,68],[56,66,56,68],[12,6,12,15],[62,26,62,35],[63,26,63,35],[16,16,16,18],[16,27,16,39],[19,6,19,15],[19,16,19,18],[19,27,19,39],[53,38,53,40],[55,38,55,40],[60,38,60,40],[61,38,61,40],[62,38,62,40],[63,38,63,40],[56,26,56,35],[57,26,57,35],[60,26,60,35],[61,26,61,35],[59,26,59,35],[20,6,20,15],[57,66,57,68],[58,66,58,68],[59,66,59,68],[20,27,20,39],[12,27,12,39],[58,26,58,35],[7,6,7,15],[23,6,23,15],[8,16,8,18],[51,153,51,172],[10,16,10,18],[11,16,11,18],[23,16,23,18],[13,6,13,15],[13,16,13,18],[13,27,13,39],[17,6,17,15],[14,16,14,18],[14,27,14,39],[17,16,17,18],[17,27,17,39],[18,6,18,15],[18,16,18,18],[18,27,18,39],[24,16,24,18],[10,6,10,15],[53,66,53,68],[11,6,11,15],[24,6,24,15],[8,6,8,15],[9,6,9,15],[9,16,9,18],[0,6,0,15],[1,6,1,15],[2,6,2,15],[3,6,3,15],[4,6,4,15],[5,6,5,15],[6,6,6,15],[14,6,14,15],[16,6,16,15],[20,16,20,18],[0,27,0,39],[5,16,5,18],[6,16,6,18],[7,16,7,18],[1,27,1,39],[2,27,2,39],[3,27,3,39],[4,27,4,39],[5,27,5,39],[6,27,6,39],[7,27,7,39],[0,16,0,18],[1,16,1,18],[2,16,2,18],[3,16,3,18],[4,16,4,18],[220,38,220,40],[201,38,201,40],[8,27,8,39],[9,27,9,39],[10,27,10,39],[11,27,11,39],[12,16,12,18],[72,38,72,40],[184,38,184,40],[185,38,185,40],[198,38,198,40],[199,38,199,40],[212,38,212,40],[213,38,213,40],[59,38,59,40],[54,38,54,40],[15,6,15,15],[15,16,15,18],[15,27,15,39],[237,38,237,40],[238,38,238,40],[239,38,239,40],[195,38,195,40],[193,38,193,40],[229,38,229,40],[227,38,227,40],[225,38,225,40],[226,38,226,40],[53,26,53,35],[54,26,54,35],[55,26,55,35],[23,27,23,39],[24,27,24,39],[90,26,90,35],[91,26,91,35],[92,26,92,35],[93,26,93,35],[94,26,94,35],[95,26,95,35],[21,27,21,39],[54,66,54,68],[55,66,55,68],[177,90,177,92],[221,38,221,40],[218,38,218,40],[219,38,219,40],[166,90,166,92],[164,90,164,92],[165,90,165,92],[175,90,175,92],[216,38,216,40],[217,38,217,40],[173,90,173,92],[174,90,174,92],[172,90,172,92],[170,90,170,92],[171,90,171,92],[167,90,167,92],[168,90,168,92],[169,90,169,92],[214,38,214,40],[215,38,215,40],[211,38,211,40],[209,38,209,40],[157,90,157,92],[176,90,176,92],[53,90,53,92],[56,90,56,92],[57,90,57,92],[58,90,58,92],[59,90,59,92],[54,90,54,92],[65,90,65,92],[66,90,66,92],[60,90,60,92],[61,90,61,92],[62,90,62,92],[63,90,63,92],[64,90,64,92],[55,90,55,92],[67,90,67,92],[81,90,81,92],[83,90,83,92],[84,90,84,92],[85,90,85,92],[86,90,86,92],[103,90,103,92],[75,90,75,92],[22,6,22,15],[22,16,22,18],[22,27,22,39],[71,26,71,35],[21,6,21,15],[21,16,21,18],[70,26,70,35],[65,26,65,35],[67,38,67,40],[71,38,71,40],[66,26,66,35],[65,38,65,40],[64,38,64,40],[56,38,56,40],[57,38,57,40],[58,38,58,40],[68,26,68,35],[66,38,66,40],[189,90,189,92],[190,90,190,92],[191,90,191,92],[192,90,192,92],[193,90,193,92],[194,90,194,92],[197,90,197,92],[196,38,196,40],[191,38,191,40]]}
["種族名","肉体","集中","反射","知識","幸運","種族特典",null,null,null,null,null,null,null,null,null,"名称",null,null,"SL","種別","ﾀｲﾐﾝｸﾞ","対象","射程","判定値","代償","コスト","自動取得"]
["人間",6,12,7,8,8,"常時C値-1(下限値16) & 集中判定を1度振り直せる。",null,null,null,null,null,null,null,null,null,"起死回生",null,null,"★","自","ｵｰﾄ","自","なし","自動","6BP",0,"判定直後ダイス目を両方9にする。対抗判定のC値が20固定。戦闘外では-2BP。",null,null,null,null,null,null,null,null,null,null,null,null,null,null,null,"近",{"$f":"IF(クラスA=\"PD\",CL*2,0)+IF(クラスB=\"PD\",CL*2,0)-IF(AND(クラスA=\"PD\",クラスB=\"PD\"),CL*2,0)\n+IF(クラスA=\"MA\",CL*6,0)+IF(クラスB=\"MA\",CL*6,0)-IF(AND(クラスA=\"MA\",クラスB=\"MA\"),CL*6,0)","v":0}]
["天使",6,8,7,11,8,{"$f":"\"封印,不動無効。ｸﾘﾃｨｶﾙでMPを\"&(5+CS!S10*2)&\"点回復。\"","v":"封印,不動無効。ｸﾘﾃｨｶﾙでMPを7点回復。"},null,null,null,null,null,null,null,null,null,"祝福",null,null,"★","自","ｵｰﾄ","[単]","0-5","自動","2BP",0,"ｶｳﾝﾄ開始時に使用。対象のスキル使用回数を1回回復する。",null,null,null,null,null,null,null,null,null,null,null,null,null,null,null,"遠",{"$f":"IF(クラスA=\"PD\",CL*2,0)+IF(クラスB=\"PD\",CL*2,0)-IF(AND(クラスA=\"PD\",クラスB=\"PD\"),CL*2,0)\n+IF(クラスA=\"MA\",CL*6,0)+IF(クラスB=\"MA\",CL*6,0)-IF(AND(クラスA=\"MA\",クラスB=\"MA\"),CL*6,0)","v":0}]
["悪魔",10,6,7,11,6,"種別：魔のスキルのバステ無効 & 通常攻撃のコスト-1",null,null,null,null,null,null,null,null,null,"増幅する苦痛",null,null,"★","自","ｵｰﾄ","単","0-4","自動","7BP",5,"敵(対象)が受けたダメージの半分(↓)を他の敵全てに与える。",null,null,null,null,null,null,null,null,null,null,null,null,null,null,null,"炎",{"$f":"IF(クラスA=\"FS\",CL*3,0)+IF(クラスA=\"TE\",CL*3,0)+IF(クラスA=\"CR\",CL+2)+IF(クラスA=\"AW\",CL*3)+IF(クラスB=\"FS\",CL*3,0)+IF(クラスB=\"TE\",CL*3,0)+IF(クラスB=\"CR\",CL+2)+IF(クラスB=\"AW\",CL*3)-IF(AND(クラスA=\"FS\",クラスB=\"FS\"),CL*3,0)-IF(AND(クラスA=\"TE\",クラスB=\"TE\"),CL*3,0)-IF(AND(クラスA=\"CR\",クラスB=\"CR\"),CL+2)-IF(AND(クラスA=\"AW\",クラスB=\"AW\"),CL*3)+IF(クラスA=\"MA\",CL*6,0)+IF(クラスB=\"MA\",CL*6,0)-IF(AND(クラスA=\"MA\",クラスB=\"MA\"),CL*6,0)","v":3}]
["妖精",7,9,6,8,10,"サブアクションで、サブアクションのスキルを2つ使用できる。",null,null,null,null,null,null,null,null,null,"マナシールド",null,null,"★","自","ｻﾌﾞ","N体","0-2","自動","NBP",0,{"$f":"\"〈近〉〈遠〉以外の属性を[N+2]個指定し、20C間、その属性D-\"&30+CS!S10*8","v":"〈近〉〈遠〉以外の属性を[N+2]個指定し、20C間、その属性D-38"},null,null,null,null,null,null,null,null,null,null,null,null,null,null,null,"氷",{"$f":"IF(クラスA=\"FS\",CL*3,0)+IF(クラスA=\"FC\",CL*2,0)+IF(クラスA=\"CR\",CL+2)+IF(クラスB=\"FS\",CL*3,0)+IF(クラスB=\"FC\",CL*2,0)+IF(クラスB=\"CR\",CL+2)-IF(AND(クラスA=\"FS\",クラスB=\"FS\"),CL*3,0)-IF(AND(クラスA=\"FC\",クラスB=\"FC\"),CL*2,0)-IF(AND(クラスA=\"CR\",クラスB=\"CR\"),CL+2)\n-IF(クラスA=\"MA\",CL*6,0)-IF(クラスB=\"MA\",CL*6,0)+IF(AND(クラスA=\"MA\",クラスB=\"MA\"),CL*6,0)","v":5}]
["鳥人",9,6,13,6,6,{"$f":"\"行動順決定での敏捷に+\"&(CS!S10*3)&\" & 移動ｺｽﾄ-1\"","v":"行動順決定での敏捷に+3 & 移動ｺｽﾄ-1"},null,null,null,null,null,null,null,null,null,"ソニックムーブ",null,null,"★","自","ｵｰﾄ","自","なし","自動","3BP",0,"ｶｳﾝﾄ開始時に使用。即座に行動手番を迎える。",null,null,null,null,null,null,null,null,null,null,null,null,null,null,null,"水",{"$f":"IF(クラスA=\"FC\",CL*2,0)+IF(クラスA=\"TE\",CL*3,0)+IF(クラスA=\"CR\",CL+2)\n+IF(クラスB=\"FC\",CL*2,0)+IF(クラスB=\"TE\",CL*3,0)+IF(クラスB=\"CR\",CL+2)-IF(AND(クラスA=\"FC\",クラスB=\"FC\"),CL*2,0)-IF(AND(クラスA=\"TE\",クラスB=\"TE\"),CL*3,0)-IF(AND(クラスA=\"CR\",クラスB=\"CR\"),CL+2)\n-IF(クラスA=\"MA\",CL*6,0)-IF(クラスB=\"MA\",CL*6,0)+IF(AND(クラスA=\"MA\",クラスB=\"MA\"),CL*6,0)","v":2}]
["竜人",13,7,5,10,5,"常時F値+3 & 「BS：KB(X)」を70%で無効。",null,null,null,null,null,null,null,null,null,"ドラゴンフォース",null,null,"★","自","ｽﾀｰﾄ","自","なし","自動","NBP",0,{"$f":"\"戦闘中、与えるダメージに+[N×\"&(1+ROUNDUP(CS!S10/3,0))&\"+\"&CS!S10*2&\"]する。\"","v":"戦闘中、与えるダメージに+[N×2+2]する。"},null,null,null,null,null,null,null,null,null,null,null,null,null,null,null,"雷",{"$f":"IF(クラスA=\"FC\",CL*2,0)+IF(クラスA=\"CR\",CL+2)+IF(クラスA=\"AW\",CL*3)+IF(クラスB=\"FC\",CL*2,0)+IF(クラスB=\"CR\",CL+2)+IF(クラスB=\"AW\",CL*3)-IF(AND(クラスA=\"FC\",クラスB=\"FC\"),CL*2,0)-IF(AND(クラスA=\"CR\",クラスB=\"CR\"),CL+2)-IF(AND(クラスA=\"AW\",クラスB=\"AW\"),CL*3)\n-IF(クラスA=\"MA\",CL*6,0)-IF(クラスB=\"MA\",CL*6,0)+IF(AND(クラスA=\"MA\",クラスB=\"MA\"),CL*6,0)","v":2}]
["獣人",9,5,14,5,7,"近接攻撃の回避の達成値+2 & 反射判定と回避判定のC値-1 F値3固定。",null,null,null,null,null,null,null,null,null,"ワイルドラッシュ",null,null,"★","自","ｵｰﾄ","自","なし","自動","6BP",0,"行動手番後使用。追加ﾒｲﾝを得て攻撃を行う。そのときのｺｽﾄに-5する。",null,null,null,null,null,null,null,null,null,null,null,null,null,null,null,"風",{"$f":"IF(クラスA=\"FC\",CL*2,0)+IF(クラスA=\"TE\",CL*3,0)+IF(クラスA=\"CR\",CL+2)+IF(クラスB=\"FC\",CL*2,0)+IF(クラスB=\"TE\",CL*3,0)+IF(クラスB=\"CR\",CL+2)-IF(AND(クラスA=\"FC\",クラスB=\"FC\"),CL*2,0)-IF(AND(クラスA=\"TE\",クラスB=\"TE\"),CL*3,0)-IF(AND(クラスA=\"CR\",クラスB=\"CR\"),CL+2)\n+IF(クラスA=\"MA\",CL*6,0)+IF(クラスB=\"MA\",CL*6,0)-IF(AND(クラスA=\"MA\",クラスB=\"MA\"),CL*6,0)","v":2}]
["吸血鬼",12,5,9,9,5,{"$f":"\"ﾀﾞﾒｰｼﾞを与えた時または10ｶｳﾝﾄ毎に、HPを\"&(CS!S10*3+10)&\"点回復する。\"","v":"ﾀﾞﾒｰｼﾞを与えた時または10ｶｳﾝﾄ毎に、HPを13点回復する。"},null,null,null,null,null,null,null,null,null,"鮮血の一撃",null,null,"★","自","ﾀﾞﾒﾛ","自","なし","自動","3BP",0,"ダメージロールで振るダイスの目を全て最大値にする。",null,null,null,null,null,null,null,null,null,null,null,null,null,null,null,"土",{"$f":"IF(クラスA=\"FC\",CL*2,0)+IF(クラスA=\"TE\",CL*3,0)+IF(クラスA=\"CR\",CL+2)+IF(クラスB=\"FC\",CL*2,0)+IF(クラスB=\"TE\",CL*3,0)+IF(クラスB=\"CR\",CL+2)-IF(AND(クラスA=\"FC\",クラスB=\"FC\"),CL*2,0)-IF(AND(クラスA=\"TE\",クラスB=\"TE\"),CL*3,0)-IF(AND(クラスA=\"CR\",クラスB=\"CR\"),CL+2)\n-IF(クラスA=\"MA\",CL*6,0)-IF(クラスB=\"MA\",CL*6,0)+IF(AND(クラスA=\"MA\",クラスB=\"MA\"),CL*6,0)","v":2}]
["偽人",5,7,6,12,10,"人間以外のキメラ不可。",null,null,null,null,null,null,null,null,null,"真姿解放",null,null,"★","自","ｵｰﾄ","自","なし","自動","2BP",0,"いつでも使用可。あなたは[解放状態]となる。",null,null,null,null,null,null,null,null,null,null,null,null,null,null,null,"光",{"$f":"IF(クラスA=\"YM\",CL*2,0)+IF(クラスA=\"CR\",CL+2)+IF(クラスB=\"YM\",CL*2,0)+IF(クラスB=\"CR\",CL+2)-IF(AND(クラスA=\"YM\",クラスB=\"YM\"),CL*2,0)-IF(AND(クラスA=\"CR\",クラスB=\"CR\"),CL+2)","v":0}]
["魔法人形",5,10,5,10,10,{"$f":"\"「種別：魔」の被ﾀﾞﾒ-\"&10+CS!S10*3&\" & 準備期間を-1してコスト+1\"","v":"「種別：魔」の被ﾀﾞﾒ-13 & 準備期間を-1してコスト+1"},null,null,null,null,null,null,null,null,null,"エナジーバースト",null,null,"★","自","ｵｰﾄ","自","なし","自動","5BP",0,"C開始時に使用。次判定達成値+10 与D+[物攻or魔攻] C終了後HP0。",null,null,null,null,null,null,null,null,null,null,null,null,null,null,null,"闇",{"$f":"IF(クラスA=\"YM\",CL*2,0)+IF(クラスA=\"CR\",CL+2)+IF(クラスA=\"AW\",CL*3)+IF(クラスB=\"YM\",CL*2,0)+IF(クラスB=\"CR\",CL+2)+IF(クラスB=\"AW\",CL*3)-IF(AND(クラスA=\"YM\",クラスB=\"YM\"),CL*2,0)-IF(AND(クラスA=\"CR\",クラスB=\"CR\"),CL+2)-IF(AND(クラスA=\"AW\",クラスB=\"AW\"),CL*3)","v":0}]
["死神",11,8,9,7,5,{"$f":"\"攻撃全てに「BS：即死(\"&CS!S10*5&\")」付与。 & ﾀﾞﾒｰｼﾞ+[現ｶｳﾝﾄ/5(↓)」\"","v":"攻撃全てに「BS：即死(5)」付与。 & ﾀﾞﾒｰｼﾞ+[現ｶｳﾝﾄ/5(↓)」"},null,null,null,null,null,null,null,null,null,"死神の鎌",null,null,"★","自","ｻﾌﾞ","自","なし","自動","4BP",3,"35Cの間、武器を「死神の鎌」に変更。"]
["神格",7,8,6,13,6,"攻撃でﾀﾞﾒｰｼﾞを受けた時、与えた対象に「BS：怯み(1)」付与。",null,null,null,null,null,null,null,null,null,"Paranormal Power",null,null,"★","自","ｽﾀｰﾄ","自","なし","自動","1BP",1,{"$f":"\"①全達成値+1 ②ﾀﾞﾒｰｼﾞ+\"&CS!S10+5&\" ③C値-1 のどれかを戦闘中適用。\"","v":"①全達成値+1 ②ﾀﾞﾒｰｼﾞ+6 ③C値-1 のどれかを戦闘中適用。"}]
["妖怪",10,4,8,6,12,"判定の1,2の目1つを3にする。感情の強度の合計値-1。",null,null,null,null,null,null,null,null,null,"妖力波",null,null,"★","自","ｵｰﾄ","単","0-4","自動","2BP",3,"出目17以下の判定の低い方の出目を1にする。その後振り直しなど不可。"]
["花姫",5,12,5,13,5,{"$f":"\"攻撃に「BS：花毒(\"&CS!S10+5&\")」付与。 & ｸﾗｽｽｷﾙのSL上限に+1\"","v":"攻撃に「BS：花毒(6)」付与。 & ｸﾗｽｽｷﾙのSL上限に+1"},null,null,null,null,null,null,null,null,null,"フルブルーム",null,null,"★","自","ｵｰﾄ","自","なし","自動","2BP",0,{"$f":"\"C開始時使用。HP\"&CS!S10*15+90&\"回復。以後ｻﾌﾞｱｸｼｮﾝｽｷﾙでﾌﾗﾜｰC1つ獲得。\"","v":"C開始時使用。HP105回復。以後ｻﾌﾞｱｸｼｮﾝｽｷﾙでﾌﾗﾜｰC1つ獲得。"}]
["虫人",11,5,11,6,7,"DでHP0になる場合、HPを1にする。1/Sce & 「BS：花毒」を60%で無効 ",null,null,null,null,null,null,null,null,null,"タクタイルムーブ",null,null,"★","自","ｵｰﾄ","自","なし","自動","2BP",0,{"$f":"\"回避判定直前使用。達成値+\"&(3+ROUNDUP(CS!S10/3,0))&\"。回避成功の場合,次の命中+\"&(3+ROUNDUP(CS!S10/3,0))","v":"回避判定直前使用。達成値+4。回避成功の場合,次の命中+4"}]
["戦乙女",7,10,8,10,5,"全てのｽｷﾙ代償-1MP。(下限値：3MP) 感情の個数-1",null,null,null,null,null,null,null,null,null,"トゥルーフェイス",null,null,"★","自","ｵｰﾄ","自","なし","自動","4BP",0,{"$f":"\"感情が2つ以下でのみ使用可。全達成値+2 & 与D+\"&(CL*6+20)&\"　1ｾｯｼｮﾝ1回\"","v":"感情が2つ以下でのみ使用可。全達成値+2 & 与D+26　1ｾｯｼｮﾝ1回"}]
["半魚人",7,8,12,8,5,"ﾀﾞﾒｰｼﾞﾛｰﾙで5MP支払って〈水〉に変更できる。 & 全てのｽｷﾙ代償+1MP",null,null,null,null,null,null,null,null,null,"フリーズバインド",null,null,"★","自","ｵｰﾄ","自","なし","自動","1BP",0,"攻撃宣言時に使用。命中C値-2 達成値+1し、回避判定振り直し不可。"]
["魔道士",5,8,8,14,5,{"$f":"\"「種別：魔」かつ「単体」のｽｷﾙが回避されたとき、同属性\"&20+CL*3&\"点ﾀﾞﾒｰｼﾞを与える。\"","v":"「種別：魔」かつ「単体」のｽｷﾙが回避されたとき、同属性23点ﾀﾞﾒｰｼﾞを与える。"},null,null,null,null,null,null,null,null,null,"予備魔力開放",null,null,"★","自","ｵｰﾄ","自","なし","自動","NBP",0,{"$f":"\"①C開始時使用→HP&MP[N*\"&CL+8&\"]点回復。②ﾀﾞﾒﾛ直前使用→与D+[N*\"&CL+10&\"]\"","v":"①C開始時使用→HP&MP[N*9]点回復。②ﾀﾞﾒﾛ直前使用→与D+[N*11]"}]
["付喪神",4,7,8,7,14,"ｶｳﾝﾄ開始時に任意ﾏｽ配置可能 1/Sce & 単体攻撃ｽｷﾙの命中C値-2",null,null,null,null,null,null,null,null,null,"九十九神力",null,null,"★","自","ｵｰﾄ","自","なし","自動","7BP",0,"HPが0になる瞬間に使用可能。HP全回復して、BS全解除。"]
["幽体",0,12,9,11,8,{"$f":"\"10ｶｳﾝﾄ毎に、MP\"&10+ROUNDUP(CL/2,0)&\"点減少 & MP0で戦闘不能 & 常時[感情の強度]+1\"","v":"10ｶｳﾝﾄ毎に、MP11点減少 & MP0で戦闘不能 & 常時[感情の強度]+1"},null,null,null,null,null,null,null,null,null,"ソウルシード",null,null,"★","自","ｵｰﾄ","自","なし","自動","10BP",0,{"$f":"\"C開始時に使用。HP&MP全回復 その後、行動手番毎にMP[\"&CL&\"+2D10]点回復\"","v":"C開始時に使用。HP&MP全回復 その後、行動手番毎にMP[1+2D10]点回復"}]
["鬼",14,4,14,4,4,"CまたはFの自身判定振り直し不可 & 怯み無効",null,null,null,null,null,null,null,null,null,"Unlimited Power",null,null,"★","自","ｵｰﾄ","自","なし","自動","9BP",0,{"$f":"\"この戦闘中ｽｷﾙ攻撃で与えるダメージに+現カウント (上限値：\"&CL*6+40&\")\"","v":"この戦闘中ｽｷﾙ攻撃で与えるダメージに+現カウント (上限値：46)"}]
["爬虫人",10,10,10,4,6,"BSを1D10<=2で無効。命中F値-2 (下限値：3)",null,null,null,null,null,null,null,null,null,"スケイルシールド",null,null,"★","自","ﾀﾞﾒﾛ","自","なし","自動","1BP",0,{"$f":"\"自身の受けるダメージを\"&CL*12+60&\"点軽減。ダメージ0の場合 MP\"&CL+5&\"点回復\"","v":"自身の受けるダメージを72点軽減。ダメージ0の場合 MP6点回復"}]
["キメラ忌",{"$f":"ROUNDUP((VLOOKUP(キメラA,VL用!$A$2:$F$52,B26,FALSE)+VLOOKUP(キメラB,VL用!$A$2:$F$52,B26,FALSE))/2,0)","v":{"$error":"#N/A"}},{"$f":"ROUNDUP((VLOOKUP(キメラA,VL用!$A$2:$F$52,C26,FALSE)+VLOOKUP(キメラB,VL用!$A$2:$F$52,C26,FALSE))/2,0)","v":{"$error":"#N/A"}},{"$f":"ROUNDUP((VLOOKUP(キメラA,VL用!$A$2:$F$52,D26,FALSE)+VLOOKUP(キメラB,VL用!$A$2:$F$52,D26,FALSE))/2,0)","v":{"$error":"#N/A"}},{"$f":"ROUNDUP((VLOOKUP(キメラA,VL用!$A$2:$F$52,E26,FALSE)+VLOOKUP(キメラB,VL用!$A$2:$F$52,E26,FALSE))/2,0)","v":{"$error":"#N/A"}},{"$f":"ROUNDUP((VLOOKUP(キメラA,VL用!$A$2:$F$52,F26,FALSE)+VLOOKUP(キメラB,VL用!$A$2:$F$52,F26,FALSE))/2,0)","v":{"$error":"#N/A"}},{"$f":"VLOOKUP(キメラA,A1:P52,7,FALSE)","v":{"$error":"#N/A"}},null,null,null,null,null,null,null,null,null,"忌み嫌われし存在",null,null,"★","自","常時","自","なし","なし","なし","なし",{"$f":"\"感情強度合計値-4。〈炎〉～〈闇〉耐性+\"&5+CS!S10*2&\" 4MP以上のｽｷﾙ代償-1MP\"","v":"感情強度合計値-4。〈炎〉～〈闇〉耐性+7 4MP以上のｽｷﾙ代償-1MP"}]
["キメラ祝",{"$f":"B24","v":{"$error":"#N/A"}},{"$f":"C24","v":{"$error":"#N/A"}},{"$error":"#N/A"},{"$error":"#N/A"},{"$error":"#N/A"},{"$f":"VLOOKUP(キメラA,A1:P25,7,FALSE)","v":{"$error":"#N/A"}},null,null,null,null,null,null,null,null,null,"祝福されし存在",null,null,"★","自","常時","自","なし","なし","なし","なし","感情強度合計値+3。常時感情ロールの出目+1。"]
[null,2,3,4,5,6,2,3,4,5,6,7,8,9,10,11,12,13,14,15,16,17,18,19,20,21,null,2,3,4,5,6,7,8,9,10,11,12,13,14,15,16,17,18,19,20,21,null,2,3,4,5,6,7,8,9,10,11,12,13,14,15,16,17,18,19,20,21,null,2,3,4,5,6,7,8,9,10,11,12,13,14,15,16,17,18,19,20,21,null,2,3,4,5,6,7,8,9,10,11,12,13,14,15,16,17,18,19,20,21,null,2,3,4,5,6,7,8,9,10,11,12,13,14,15,16,17,18,19,20,21,null,2,3,4,5,6,7,8,9,10,11,12,13,14,15,16,17,18,19,20,21,null,2,3,4,5,6,7,8,9,10,11,12,13,14,15,16,17,18,19,20,21,null,2,3,4,5,6,7,8,9,10,11,12,13,14,15,16,17,18,19,20,21,null,2,3,4,5,6,7,8,9,10,11,12,13,14,15,16,17,18,19,20,21]
[null,2,null,null,null,"能力値","近接","射撃","回避","魔術","抵抗","敏捷","物攻","魔攻","耐久","精神","近","遠","炎","氷","水","雷","風","土","光","闇","能力値","近接","射撃","回避","魔術","抵抗","敏捷","物攻","魔攻","耐久","精神","近","遠","炎","氷","水","雷","風","土","光","闇","能力値","近接","射撃","回避","魔術","抵抗","敏捷","物攻","魔攻","耐久","精神","近","遠","炎","氷","水","雷","風","土","光","闇","能力値","近接","射撃","回避","魔術","抵抗","敏捷","物攻","魔攻","耐久","精神","近","遠","炎","氷","水","雷","風","土","光","闇","能力値","近接","射撃","回避","魔術","抵抗","敏捷","物攻","魔攻","耐久","精神","近","遠","炎","氷","水","雷","風","土","光","闇","能力値","近接","射撃","回避","魔術","抵抗","敏捷","物攻","魔攻","耐久","精神","近","遠","炎","氷","水","雷","風","土","光","闇","能力値","近接","射撃","回避","魔術","抵抗","敏捷","物攻","魔攻","耐久","精神","近","遠","炎","氷","水","雷","風","土","光","闇","能力値","近接","射撃","回避","魔術","抵抗","敏捷","物攻","魔攻","耐久","精神","近","遠","炎","氷","水","雷","風","土","光","闇","能力値","近接","射撃","回避","魔術","抵抗","敏捷","物攻","魔攻","耐久","精神","近","遠","炎","氷","水","雷","風","土","光","闇","能力値","近接","射撃","回避","魔術","抵抗","敏捷","物攻","魔攻","耐久","精神","近","遠","炎","氷","水","雷","風","土","光","闇"]
[null,2,null,null,null,"人間",5,5,3,4,3,4,10,10,100,30,10,10,0,0,-5,0,5,2,4,3,"人間",6,6,4,5,4,5,12,11,122,32,13,12,-1,1,-4,-2,8,4,6,5,"人間",7,7,5,6,5,6,14,13,146,35,16,14,-3,3,-3,-4,11,6,7,7,"人間",8,9,6,8,6,7,15,15,170,38,19,17,-5,4,0,-6,15,7,10,8,"人間",10,10,8,10,8,8,17,16,194,41,22,20,-6,5,2,-9,19,10,12,11,"人間",11,12,10,12,10,9,19,18,222,44,25,23,-9,6,4,-12,22,12,14,13,"人間",13,13,12,13,12,10,22,21,250,47,28,26,-12,7,6,-15,26,13,16,15,"人間",14,14,13,15,13,12,25,23,274,50,32,28,-15,8,7,-18,30,15,19,17,"人間",16,16,14,17,14,14,28,25,300,53,35,30,-16,9,10,-21,32,18,22,20,"人間",18,18,15,18,15,15,32,26,330,56,38,33,-18,10,12,-24,35,22,25,22]
[null,3,null,null,null,"天使",3,4,3,5,3,3,10,13,88,35,8,11,3,3,3,0,-10,10,14,-20,"天使",4,5,4,7,5,4,12,15,106,38,10,13,3,5,4,2,-13,15,18,-21,"天使",7,7,5,8,6,5,14,18,120,42,12,15,3,6,4,2,-15,18,22,-23,"天使",8,9,6,10,7,6,16,21,146,45,14,18,4,9,5,3,-18,22,27,-25,"天使",9,11,7,12,8,7,18,24,170,48,17,21,4,10,5,4,-21,25,30,-27,"天使",11,12,9,13,9,9,20,26,198,52,20,24,4,13,7,4,-23,28,33,-29,"天使",13,13,10,15,11,10,22,29,220,55,23,27,5,15,8,5,-25,32,37,-31,"天使",14,15,11,16,12,11,23,32,244,58,26,30,5,17,10,5,-27,36,41,-33,"天使",15,17,13,18,13,12,25,35,262,61,29,33,5,19,12,6,-29,39,45,-35,"天使",17,19,14,19,14,13,27,38,280,65,33,37,6,20,13,7,-33,43,50,-38]
[null,3,null,null,null,"悪魔",4,3,3,4,4,1,13,8,115,28,10,8,4,4,1,0,-2,3,-10,10,"悪魔",5,4,4,6,6,2,16,11,145,32,13,11,6,6,2,3,-4,5,-13,13,"悪魔",6,6,5,7,7,3,18,13,169,35,16,14,8,10,3,5,-6,7,-15,16,"悪魔",8,8,6,8,8,3,20,15,195,39,20,17,10,11,5,6,-7,8,-18,18,"悪魔",9,10,7,9,9,4,22,17,221,41,23,20,11,13,7,7,-11,10,-21,21,"悪魔",11,12,8,11,10,4,24,19,245,43,27,24,13,14,9,9,-13,11,-24,24,"悪魔",13,14,10,13,12,5,26,22,269,47,30,27,14,16,10,10,-15,13,-26,28,"悪魔",14,15,11,14,14,5,30,25,295,50,33,30,16,17,12,11,-18,14,-29,32,"悪魔",16,16,12,16,16,6,33,28,323,53,37,33,18,19,14,12,-21,15,-32,35,"悪魔",17,17,13,18,17,7,36,32,355,58,40,36,20,22,15,14,-24,17,-35,39]
[null,4,null,null,null,"妖精",4,5,3,4,4,5,9,10,85,34,7,8,3,0,9,-5,10,3,0,0,"妖精",5,7,4,5,5,6,11,13,103,37,10,11,5,1,13,-5,13,5,1,1,"妖精",7,8,5,7,7,8,14,16,121,41,12,14,7,1,15,-5,15,8,2,2,"妖精",9,9,7,8,8,9,16,19,137,44,14,17,10,2,18,-5,18,10,3,3,"妖精",10,10,8,10,9,10,19,21,153,47,16,20,12,2,21,-5,20,11,4,4,"妖精",11,12,9,11,10,11,21,23,165,50,18,23,14,3,24,-6,22,13,6,5,"妖精",12,14,10,13,11,12,23,25,185,53,20,25,17,4,27,-6,24,14,7,7,"妖精",14,15,11,14,13,14,25,28,203,56,22,28,19,4,30,-7,26,15,10,8,"妖精",15,17,13,16,14,15,27,31,223,59,24,31,22,5,33,-7,29,16,10,9,"妖精",17,19,15,18,16,16,29,34,245,63,27,33,24,6,36,-8,31,18,11,10]
[null,4,null,null,null,"鳥人",4,4,3,5,3,6,6,6,92,26,10,4,2,-10,2,-10,10,10,0,-5,"鳥人",5,6,4,7,4,8,8,9,118,28,12,6,3,-8,2,-12,13,16,1,-4,"鳥人",7,8,6,8,5,9,10,11,142,31,14,8,4,-7,3,-14,17,23,1,-3,"鳥人",8,9,7,9,6,11,13,13,160,35,16,10,5,-6,3,-16,20,29,1,-2,"鳥人",10,10,9,10,7,13,15,16,178,38,19,13,6,-5,4,-17,24,35,2,-1,"鳥人",11,12,11,11,9,14,18,18,190,41,22,16,8,-5,4,-21,28,41,2,0,"鳥人",13,13,12,13,10,16,20,20,212,44,25,19,9,-5,5,-23,31,47,2,1,"鳥人",14,14,13,14,11,18,23,22,236,47,28,22,10,-5,5,-25,35,54,2,2,"鳥人",15,16,15,16,13,20,26,24,262,50,31,24,11,-5,6,-28,38,60,3,3,"鳥人",17,17,16,18,15,22,29,27,288,53,34,26,12,-5,7,-31,43,66,3,4]
[null,5,null,null,null,"竜人",4,3,2,4,4,0,15,13,128,15,15,12,17,14,0,15,12,16,0,0,"竜人",5,4,3,6,5,1,18,17,162,18,18,14,23,21,0,18,14,20,1,2,"竜人",7,5,4,7,7,1,21,20,194,21,20,16,28,27,0,21,17,23,2,2,"竜人",9,7,5,8,8,2,23,22,226,23,23,19,32,32,0,25,20,25,2,3,"竜人",11,8,6,10,9,2,25,25,254,25,27,23,36,37,0,29,25,28,3,4,"竜人",12,10,7,12,10,3,28,28,279,28,31,27,41,40,0,34,16,34,3,4,"竜人",14,12,9,14,13,3,31,30,303,31,35,31,46,43,0,38,26,39,4,5,"竜人",15,13,10,15,15,4,34,33,329,35,39,35,50,47,0,43,29,41,5,5,"竜人",17,15,11,17,16,4,37,36,361,37,42,38,55,53,0,48,32,46,5,6,"竜人",19,17,12,18,18,5,40,38,392,40,46,42,59,56,0,52,55,50,6,7]
[null,5,null,null,null,"獣人",4,4,4,4,3,3,11,10,104,20,9,5,-8,6,1,-4,3,11,2,2,"獣人",6,5,5,6,4,4,13,12,127,23,12,8,-10,8,2,-4,3,11,2,2,"獣人",7,7,7,7,6,5,15,14,152,26,15,10,-13,10,3,-4,7,18,4,5,"獣人",9,8,9,8,7,7,18,16,175,28,17,12,-15,12,3,-4,9,21,5,7,"獣人",10,9,10,9,8,10,20,19,202,31,20,14,-18,13,4,-3,12,24,6,9,"獣人",11,10,12,11,9,12,23,21,229,34,22,16,-21,15,4,-3,14,27,7,11,"獣人",13,12,13,12,10,13,26,23,256,37,24,18,-24,17,5,-3,16,32,8,12,"獣人",14,13,15,14,12,14,29,24,282,39,26,21,-27,20,5,-2,18,36,9,14,"獣人",16,15,16,15,13,15,31,26,309,43,28,22,-30,23,6,-2,20,41,10,16,"獣人",18,17,18,17,14,18,34,28,342,46,32,24,-33,27,6,-2,23,45,12,18]
[null,6,null,null,null,"吸血鬼",4,3,3,4,3,5,11,10,120,25,13,13,-35,5,-30,3,4,2,-35,26,"吸血鬼",6,4,4,5,5,7,13,12,141,28,16,16,-38,7,-30,5,6,4,-38,34,"吸血鬼",7,6,6,7,6,9,15,14,167,32,19,19,-41,10,-30,7,8,6,-42,37,"吸血鬼",8,7,7,9,7,11,17,15,194,35,22,22,-43,12,-30,11,10,8,-45,41,"吸血鬼",10,9,8,10,8,12,19,17,222,38,25,25,-46,15,-30,13,12,10,-48,46,"吸血鬼",12,11,9,11,10,14,21,19,249,41,28,28,-49,16,-30,16,15,11,-51,51,"吸血鬼",14,12,10,13,11,16,24,22,276,44,31,31,-52,18,-30,19,18,13,-53,55,"吸血鬼",15,14,11,15,12,17,27,24,305,47,34,34,-55,20,-30,21,20,15,-56,58,"吸血鬼",17,15,12,16,13,19,31,26,335,50,37,37,-58,22,-30,23,22,17,-60,62,"吸血鬼",19,17,14,18,14,21,34,28,360,53,40,40,-61,25,-30,26,25,19,-63,66]
[null,6,null,null,null,"偽人",5,5,3,4,3,4,10,10,100,30,10,10,0,0,-5,0,5,2,4,3,"偽人",6,6,4,5,4,5,12,11,122,32,13,12,-1,1,-4,-2,8,4,6,5,"偽人",7,7,5,6,5,6,14,13,146,35,16,14,-3,3,-3,-4,11,6,7,7,"偽人",8,9,6,8,6,7,15,15,170,38,19,17,-5,4,0,-6,15,7,10,8,"偽人",10,10,8,10,8,8,17,16,194,41,22,20,-6,5,2,-9,19,10,12,11,"偽人",11,12,10,12,10,9,19,18,222,44,25,23,-9,6,4,-12,22,12,14,13,"偽人",13,13,12,13,12,10,22,21,250,47,28,26,-12,7,6,-15,26,13,16,15,"偽人",14,14,13,15,13,12,25,23,274,50,32,28,-15,8,7,-18,30,15,19,17,"偽人",16,16,14,17,14,14,28,25,300,53,35,30,-16,9,10,-21,32,18,22,20,"偽人",18,18,15,18,15,15,32,26,330,56,38,33,-18,10,12,-24,35,22,25,22]
[null,7,null,null,null,"魔法人形",4,3,3,5,4,4,7,18,50,44,3,2,20,20,20,20,10,5,6,6,"魔法人形",5,4,4,6,6,5,11,22,66,49,5,4,23,23,23,23,12,5,6,6,"魔法人形",6,5,6,8,8,7,13,25,78,53,7,6,26,25,30,31,15,5,7,7,"魔法人形",8,6,7,10,10,8,15,28,92,58,8,7,29,28,34,35,18,5,7,7,"魔法人形",9,7,8,12,11,9,18,32,106,63,10,8,31,30,36,38,21,5,8,8,"魔法人形",10,8,9,14,13,10,21,36,116,67,11,10,34,33,38,41,25,5,8,8,"魔法人形",12,9,10,16,14,11,25,41,130,72,13,11,37,35,40,45,28,5,12,12,"魔法人形",13,10,12,18,16,13,29,45,146,75,15,12,40,38,42,48,30,5,12,12,"魔法人形",14,11,13,20,18,14,31,49,162,79,17,14,43,40,45,50,33,5,10,10,"魔法人形",16,12,14,21,19,16,35,53,180,83,19,16,46,42,49,53,36,5,10,10]
[null,7,null,null,null,"死神",5,2,3,5,3,3,6,6,90,28,9,9,8,0,4,8,-5,0,-20,20,"死神",6,3,4,7,5,5,8,8,109,30,11,11,11,0,5,10,-5,0,-20,24,"死神",8,4,6,8,6,6,11,11,127,33,15,14,13,0,6,13,-5,0,-20,27,"死神",9,5,7,9,7,7,13,13,146,36,19,17,16,0,8,15,-5,0,-20,31,"死神",11,6,9,11,9,8,16,16,169,39,21,19,19,0,10,18,-5,0,-20,35,"死神",13,7,10,13,11,9,19,19,192,41,23,22,22,0,12,21,-5,0,-20,39,"死神",14,8,11,15,12,10,21,21,212,44,25,25,25,0,13,24,-5,0,-20,44,"死神",15,9,13,16,13,11,24,24,237,47,28,28,28,0,14,27,-5,0,-20,47,"死神",17,10,14,18,15,13,26,26,260,50,30,31,31,0,15,29,-5,0,-20,50,"死神",19,11,16,19,17,14,29,29,282,52,32,34,34,0,17,31,-5,0,-20,54]
[null,8,null,null,null,"神格",4,4,3,4,5,2,7,8,108,28,8,8,1,2,3,3,2,2,0,0,"神格",6,5,4,6,6,3,10,11,131,30,10,10,3,4,4,5,4,5,0,0,"神格",7,7,5,7,8,5,13,14,153,33,12,11,5,7,6,7,6,8,0,0,"神格",9,8,6,8,9,7,15,17,175,35,14,12,7,10,8,8,8,12,0,0,"神格",9,9,8,10,10,8,18,20,196,38,17,14,10,12,10,12,10,15,0,0,"神格",11,11,9,12,12,9,20,22,218,41,19,16,12,14,12,13,12,19,0,0,"神格",13,12,11,14,13,10,23,25,242,44,21,18,13,16,14,15,14,21,0,0,"神格",15,14,12,15,15,12,25,28,271,47,23,21,15,18,16,18,16,25,0,0,"神格",16,16,14,17,16,13,27,31,292,50,24,23,18,20,18,20,19,29,0,0,"神格",17,17,15,18,18,15,30,34,314,53,26,25,20,22,19,21,22,33,0,0]
[null,8,null,null,null,"妖怪",4,4,3,4,6,3,12,10,112,27,7,7,0,0,1,1,2,-3,-5,-5,"妖怪",6,5,4,6,8,4,14,12,138,29,12,11,0,0,1,1,2,-3,-5,-5,"妖怪",7,6,5,7,10,5,16,14,161,32,17,15,0,0,1,1,2,-3,-5,-5,"妖怪",8,7,6,9,11,6,19,16,189,34,21,20,0,0,1,1,2,-3,-5,-5,"妖怪",10,9,7,10,13,7,21,19,220,36,26,24,0,0,1,1,2,-3,-5,-5,"妖怪",11,10,8,12,14,9,23,21,247,38,30,28,0,0,1,1,2,-6,-5,-5,"妖怪",13,12,9,14,16,10,25,22,271,41,34,31,0,0,1,1,2,-6,-5,-5,"妖怪",14,13,10,16,17,11,28,24,295,43,38,36,0,0,1,1,2,-6,-5,-5,"妖怪",16,15,12,17,19,12,30,26,324,45,42,40,0,0,1,1,2,-6,-5,-5,"妖怪",18,16,13,18,20,13,32,28,355,48,47,45,0,0,1,1,2,-7,-5,-5]
[null,9,null,null,null,"花姫",4,4,4,4,4,5,8,8,75,35,3,15,-28,-3,10,0,5,10,25,-10,"花姫",6,5,5,5,6,6,10,11,89,38,5,19,-32,-3,14,0,5,13,28,-12,"花姫",7,6,7,7,7,7,12,13,103,42,7,24,-35,-4,16,0,5,16,31,-14,"花姫",8,8,8,8,9,8,14,15,118,46,9,28,-37,-5,19,0,5,19,35,-16,"花姫",9,9,10,10,10,10,16,18,135,50,12,32,-40,-6,22,0,5,21,38,-18,"花姫",11,11,12,10,12,11,18,20,151,53,15,38,-43,-6,25,0,8,24,43,-20,"花姫",12,12,13,12,13,13,20,22,165,56,17,42,-46,-7,27,0,8,28,46,-23,"花姫",13,14,14,13,15,14,23,24,178,58,19,47,-49,-8,31,0,8,30,51,-25,"花姫",14,15,16,14,17,15,25,26,192,61,21,50,-53,-9,34,0,8,34,53,-28,"花姫",16,16,18,16,18,16,27,28,205,65,23,54,-55,-10,37,0,8,38,57,-30]
[null,9,null,null,null,"虫人",5,4,5,3,2,3,11,7,105,23,14,14,-10,2,5,-3,-10,-11,6,6,"虫人",7,5,7,5,3,4,13,9,128,25,18,17,-12,3,5,-6,-13,-14,8,9,"虫人",8,7,8,6,5,5,15,11,156,27,21,20,-13,5,5,-10,-16,-17,11,11,"虫人",9,8,10,8,6,6,17,12,183,30,25,26,-15,7,5,-12,-20,-19,13,14,"虫人",10,9,12,9,7,7,19,13,208,32,29,29,-17,10,5,-15,-23,-21,16,17,"虫人",11,11,13,10,8,8,21,15,233,34,33,32,-19,12,5,-18,-26,-23,19,21,"虫人",13,13,14,11,10,9,23,17,256,37,36,35,-21,14,5,-20,-30,-25,21,24,"虫人",14,15,16,13,11,10,26,18,283,40,40,37,-23,17,5,-23,-33,-28,24,26,"虫人",16,16,17,14,13,11,28,19,310,42,43,40,-24,19,5,-25,-36,-31,27,28,"虫人",18,18,19,15,14,12,30,21,334,45,46,42,-26,22,5,-28,-42,-34,30,32]
[null,10,null,null,null,"戦乙女",5,3,3,4,5,5,11,9,93,32,5,4,5,0,-6,5,3,-5,5,-8,"戦乙女",6,4,4,6,6,7,13,11,115,35,7,6,8,0,-12,8,3,-5,8,-14,"戦乙女",7,5,6,7,7,8,15,13,138,38,8,8,11,0,-18,11,3,-5,11,-18,"戦乙女",9,7,7,8,9,10,18,14,161,41,10,10,13,0,-23,13,4,-5,13,-21,"戦乙女",10,8,8,10,10,12,21,16,183,45,12,11,16,0,-29,16,4,-5,16,-26,"戦乙女",12,9,10,11,12,14,24,18,206,48,13,12,20,0,-34,20,4,-5,20,-32,"戦乙女",13,10,11,13,14,15,26,21,229,51,15,14,23,0,-38,23,5,-5,23,-37,"戦乙女",15,11,12,15,15,16,28,23,253,54,17,15,25,0,-43,25,5,-5,25,-42,"戦乙女",17,13,14,16,17,18,31,25,271,57,18,17,28,0,-48,28,5,-5,28,-48,"戦乙女",19,14,15,18,19,20,33,28,292,61,20,18,31,0,-54,31,6,-5,31,-53]
[null,10,null,null,null,"半魚人",5,3,4,4,3,4,8,7,85,24,6,6,20,20,25,-25,5,5,3,3,"半魚人",6,4,5,6,5,6,10,9,101,27,8,8,20,23,28,-28,5,5,3,3,"半魚人",8,5,6,7,6,7,13,11,114,29,9,10,20,25,31,-31,5,5,3,3,"半魚人",9,7,8,8,7,9,15,13,138,32,11,12,20,28,34,-33,5,5,3,3,"半魚人",11,8,9,9,9,11,18,15,160,35,13,13,20,31,37,-36,5,5,3,3,"半魚人",13,10,10,11,11,13,21,18,187,39,15,15,20,34,40,-40,5,5,3,3,"半魚人",14,11,11,13,12,15,23,20,208,41,17,17,20,36,43,-43,5,5,3,3,"半魚人",16,12,12,14,14,16,25,23,231,44,19,18,20,39,46,-46,5,5,3,3,"半魚人",18,13,13,16,15,17,27,25,249,46,22,21,20,41,49,-50,5,5,3,3,"半魚人",19,15,15,18,17,19,30,28,262,50,24,23,20,44,53,-55,5,5,3,3]
[null,11,null,null,null,"魔道士",3,2,3,5,4,3,6,14,83,39,-3,3,2,2,2,2,2,2,10,10,"魔道士",5,3,5,7,5,4,8,17,101,42,-5,5,4,4,4,4,4,4,14,14,"魔道士",6,5,6,8,7,5,10,20,116,46,-7,7,5,5,5,5,5,5,18,18,"魔道士",7,6,7,10,9,7,12,22,131,50,-10,10,6,6,6,6,6,6,22,22,"魔道士",8,7,9,12,10,8,15,25,146,55,-13,12,7,7,7,7,7,7,25,25,"魔道士",10,8,11,13,12,9,17,28,158,59,-15,15,8,8,8,8,8,8,29,29,"魔道士",12,10,12,15,13,10,20,32,177,64,-18,17,10,10,10,10,10,10,33,33,"魔道士",14,11,13,17,15,11,23,35,194,69,-20,20,12,12,12,12,12,12,37,37,"魔道士",15,12,14,19,17,13,25,39,213,73,-23,23,13,13,13,13,13,13,40,40,"魔道士",16,13,15,21,18,14,28,43,234,77,-25,26,15,15,15,15,15,15,43,43]
[null,12,null,null,null,"付喪神",4,4,4,4,3,3,8,8,98,28,4,4,11,5,8,2,2,-5,8,2,"付喪神",6,5,6,5,5,5,11,11,119,30,6,6,16,8,13,2,5,-9,11,3,"付喪神",7,7,7,7,6,6,12,13,142,33,7,7,21,11,15,2,7,-13,14,4,"付喪神",8,8,9,9,7,8,14,15,161,36,9,9,28,14,18,3,9,-16,16,5,"付喪神",10,9,11,10,8,10,16,18,185,39,11,11,32,18,20,3,13,-21,18,6,"付喪神",11,11,13,12,10,11,19,20,212,42,12,12,36,21,23,3,15,-26,21,7,"付喪神",12,12,14,13,12,12,21,22,238,45,13,13,39,25,25,4,17,-31,23,8,"付喪神",14,14,16,14,13,13,23,24,260,48,15,15,43,28,29,4,21,-35,26,9,"付喪神",16,15,17,16,14,15,25,26,285,51,17,17,48,31,31,5,24,-38,28,10,"付喪神",17,17,19,17,15,16,27,28,314,54,18,18,52,33,35,5,26,-42,31,11]
[null,13,null,null,null,"幽体",4,4,5,4,5,6,6,12,102,30,28,27,0,3,4,17,3,4,-30,14,"幽体",5,5,7,5,6,8,8,14,128,33,31,30,0,5,7,23,5,7,-33,18,"幽体",6,6,8,6,8,9,11,16,157,36,34,33,0,7,10,26,7,9,-37,22,"幽体",8,8,9,8,10,11,13,19,174,38,37,36,1,10,12,31,8,11,-40,25,"幽体",10,10,11,9,11,13,14,22,203,40,40,40,2,12,14,34,10,13,-42,29,"幽体",11,12,13,11,13,14,16,24,227,43,43,43,3,13,17,37,12,15,-45,33,"幽体",12,13,14,13,14,16,19,27,252,45,46,45,4,15,20,40,13,18,-48,35,"幽体",14,14,15,15,16,17,22,30,279,47,49,48,5,16,23,43,15,20,-51,40,"幽体",16,15,17,16,18,19,25,32,313,49,52,51,5,18,25,45,16,22,-55,43,"幽体",17,17,19,18,19,21,28,34,338,52,55,54,5,19,28,48,18,24,-59,45]
[null,14,null,null,null,"鬼",5,4,3,5,3,2,18,17,104,20,27,26,5,5,2,6,2,3,-3,-3,"鬼",6,6,4,7,4,3,21,21,125,22,34,33,8,8,5,11,4,5,-5,-6,"鬼",8,7,5,8,5,4,25,25,147,25,41,40,11,11,8,13,6,8,-9,-8,"鬼",10,9,6,9,6,5,30,29,171,27,46,45,14,14,10,18,9,10,-12,-11,"鬼",11,10,7,11,7,6,35,33,194,30,53,51,17,17,13,22,11,12,-14,-14,"鬼",13,12,9,13,8,7,39,36,216,34,58,57,20,20,15,25,13,14,-16,-17,"鬼",15,14,10,15,9,8,44,40,242,38,63,61,24,24,18,29,15,16,-18,-19,"鬼",17,16,11,17,10,8,47,42,269,42,68,65,27,27,21,33,18,19,-20,-21,"鬼",19,18,12,19,12,9,51,46,294,46,74,70,30,30,23,37,20,21,-22,-23,"鬼",21,20,13,21,13,10,54,49,320,50,80,75,33,33,26,40,22,23,-25,-25]
[null,15,null,null,null,"爬虫人",4,5,3,3,2,4,10,13,117,21,17,17,38,6,8,3,-10,3,3,6,"爬虫人",6,6,5,4,3,5,12,15,139,24,20,19,42,9,10,0,-12,4,4,8,"爬虫人",7,8,6,6,5,6,13,18,161,27,22,21,45,11,11,0,-13,6,5,10,"爬虫人",8,9,7,8,7,7,16,22,184,30,24,23,48,13,13,0,-15,7,6,12,"爬虫人",10,10,9,9,8,8,19,25,210,34,27,25,51,14,14,0,-16,9,7,14,"爬虫人",12,12,10,11,9,9,23,29,233,37,31,27,55,17,15,0,-17,10,8,16,"爬虫人",13,13,11,12,11,10,26,33,257,41,35,29,58,20,16,0,-19,11,9,18,"爬虫人",14,15,13,13,12,11,30,35,282,45,38,32,61,23,17,0,-20,13,10,20,"爬虫人",15,16,14,15,13,12,33,38,315,48,40,35,63,25,19,0,-21,14,11,22,"爬虫人",17,17,15,17,14,13,35,40,346,52,42,39,66,27,20,0,-23,15,12,23]
[null,16,null,null,null,"キメラ忌",{"$f":"MAX(VLOOKUP(キメラA,F27:Z70,G26,FALSE),VLOOKUP(キメラB,F27:Z70,G26,FALSE))","v":{"$error":"#N/A"}},{"$f":"MAX(VLOOKUP(キメラA,F27:Z70,H26,FALSE),VLOOKUP(キメラB,F27:Z70,H26,FALSE))","v":{"$error":"#N/A"}},{"$f":"MAX(VLOOKUP(キメラA,F27:Z70,I26,FALSE),VLOOKUP(キメラB,F27:Z70,I26,FALSE))","v":{"$error":"#N/A"}},{"$f":"MAX(VLOOKUP(キメラA,F27:Z70,J26,FALSE),VLOOKUP(キメラB,F27:Z70,J26,FALSE))","v":{"$error":"#N/A"}},{"$f":"MAX(VLOOKUP(キメラA,F27:Z70,K26,FALSE),VLOOKUP(キメラB,F27:Z70,K26,FALSE))","v":{"$error":"#N/A"}},{"$f":"ROUNDDOWN(VLOOKUP(キメラA,F27:Z70,L26,FALSE)/2+VLOOKUP(キメラB,F27:Z70,L26,FALSE)/2,0)","v":{"$error":"#N/A"}},{"$f":"MIN(VLOOKUP(キメラA,F27:Z70,M26,FALSE),VLOOKUP(キメラB,F27:Z70,M26,FALSE))","v":{"$error":"#N/A"}},{"$f":"MIN(VLOOKUP(キメラA,F27:Z70,N26,FALSE),VLOOKUP(キメラB,F27:Z70,N26,FALSE))","v":{"$error":"#N/A"}},{"$f":"ROUNDDOWN(VLOOKUP(キメラA,F27:Z70,O26,FALSE)/2+VLOOKUP(キメラB,F27:Z70,O26,FALSE)/2,0)","v":{"$error":"#N/A"}},{"$f":"ROUNDDOWN(VLOOKUP(キメラA,F27:Z70,P26,FALSE)/2+VLOOKUP(キメラB,F27:Z70,P26,FALSE)/2,0)","v":{"$error":"#N/A"}},{"$f":"MIN(VLOOKUP(キメラA,F27:Z70,Q26,FALSE),VLOOKUP(キメラB,F27:Z70,Q26,FALSE))","v":{"$error":"#N/A"}},{"$f":"MIN(VLOOKUP(キメラA,F27:Z70,R26,FALSE),VLOOKUP(キメラB,F27:Z70,R26,FALSE))","v":{"$error":"#N/A"}},{"$f":"MIN(VLOOKUP(キメラA,F27:Z70,S26,FALSE),VLOOKUP(キメラB,F27:Z70,S26,FALSE))","v":{"$error":"#N/A"}},{"$f":"MIN(VLOOKUP(キメラA,F27:Z70,T26,FALSE),VLOOKUP(キメラB,F27:Z70,T26,FALSE))","v":{"$error":"#N/A"}},{"$f":"MIN(VLOOKUP(キメラA,F27:Z70,U26,FALSE),VLOOKUP(キメラB,F27:Z70,U26,FALSE))","v":{"$error":"#N/A"}},{"$f":"MIN(VLOOKUP(キメラA,F27:Z70,V26,FALSE),VLOOKUP(キメラB,F27:Z70,V26,FALSE))","v":{"$error":"#N/A"}},{"$f":"MIN(VLOOKUP(キメラA,F27:Z70,W26,FALSE),VLOOKUP(キメラB,F27:Z70,W26,FALSE))","v":{"$error":"#N/A"}},{"$f":"MIN(VLOOKUP(キメラA,F27:Z70,X26,FALSE),VLOOKUP(キメラB,F27:Z70,X26,FALSE))","v":{"$error":"#N/A"}},{"$f":"MIN(VLOOKUP(キメラA,F27:Z70,Y26,FALSE),VLOOKUP(キメラB,F27:Z70,Y26,FALSE))","v":{"$error":"#N/A"}},{"$f":"MIN(VLOOKUP(キメラA,F27:Z70,Z26,FALSE),VLOOKUP(キメラB,F27:Z70,Z26,FALSE))","v":{"$error":"#N/A"}},"キメラ忌",{"$f":"MAX(VLOOKUP(キメラA,AA27:AU70,AB26,FALSE),VLOOKUP(キメラB,AA27:AU70,AB26,FALSE))","v":{"$error":"#N/A"}},{"$f":"MAX(VLOOKUP(キメラA,AA27:AU70,AC26,FALSE),VLOOKUP(キメラB,AA27:AU70,AC26,FALSE))","v":{"$error":"#N/A"}},{"$f":"MAX(VLOOKUP(キメラA,AA27:AU70,AD26,FALSE),VLOOKUP(キメラB,AA27:AU70,AD26,FALSE))","v":{"$error":"#N/A"}},{"$f":"MAX(VLOOKUP(キメラA,AA27:AU70,AE26,FALSE),VLOOKUP(キメラB,AA27:AU70,AE26,FALSE))","v":{"$error":"#N/A"}},{"$f":"MAX(VLOOKUP(キメラA,AA27:AU70,AF26,FALSE),VLOOKUP(キメラB,AA27:AU70,AF26,FALSE))","v":{"$error":"#N/A"}},{"$f":"ROUNDDOWN(VLOOKUP(キメラA,AA27:AU70,AG26,FALSE)/2+VLOOKUP(キメラB,AA27:AU70,AG26,FALSE)/2,0)","v":{"$error":"#N/A"}},{"$f":"MIN(VLOOKUP(キメラA,AA27:AU70,AH26,FALSE),VLOOKUP(キメラB,AA27:AU70,AH26,FALSE))","v":{"$error":"#N/A"}},{"$f":"MIN(VLOOKUP(キメラA,AA27:AU70,AI26,FALSE),VLOOKUP(キメラB,AA27:AU70,AI26,FALSE))","v":{"$error":"#N/A"}},{"$f":"ROUNDDOWN(VLOOKUP(キメラA,AA27:AU70,AJ26,FALSE)/2+VLOOKUP(キメラB,AA27:AU70,AJ26,FALSE)/2,0)","v":{"$error":"#N/A"}},{"$f":"ROUNDDOWN(VLOOKUP(キメラA,AA27:AU70,AK26,FALSE)/2+VLOOKUP(キメラB,AA27:AU70,AK26,FALSE)/2,0)","v":{"$error":"#N/A"}},{"$f":"MIN(VLOOKUP(キメラA,AA27:AU70,AL26,FALSE),VLOOKUP(キメラB,AA27:AU70,AL26,FALSE))","v":{"$error":"#N/A"}},{"$f":"MIN(VLOOKUP(キメラA,AA27:AU70,AM26,FALSE),VLOOKUP(キメラB,AA27:AU70,AM26,FALSE))","v":{"$error":"#N/A"}},{"$f":"MIN(VLOOKUP(キメラA,AA27:AU70,AN26,FALSE),VLOOKUP(キメラB,AA27:AU70,AN26,FALSE))","v":{"$error":"#N/A"}},{"$f":"MIN(VLOOKUP(キメラA,AA27:AU70,AO26,FALSE),VLOOKUP(キメラB,AA27:AU70,AO26,FALSE))","v":{"$error":"#N/A"}},{"$f":"MIN(VLOOKUP(キメラA,AA27:AU70,AP26,FALSE),VLOOKUP(キメラB,AA27:AU70,AP26,FALSE))","v":{"$error":"#N/A"}},{"$f":"MIN(VLOOKUP(キメラA,AA27:AU70,AQ26,FALSE),VLOOKUP(キメラB,AA27:AU70,AQ26,FALSE))","v":{"$error":"#N/A"}},{"$f":"MIN(VLOOKUP(キメラA,AA27:AU70,AR26,FALSE),VLOOKUP(キメラB,AA27:AU70,AR26,FALSE))","v":{"$error":"#N/A"}},{"$f":"MIN(VLOOKUP(キメラA,AA27:AU70,AS26,FALSE),VLOOKUP(キメラB,AA27:AU70,AS26,FALSE))","v":{"$error":"#N/A"}},{"$f":"MIN(VLOOKUP(キメラA,AA27:AU70,AT26,FALSE),VLOOKUP(キメラB,AA27:AU70,AT26,FALSE))","v":{"$error":"#N/A"}},{"$f":"MIN(VLOOKUP(キメラA,AA27:AU70,AU26,FALSE),VLOOKUP(キメラB,AA27:AU70,AU26,FALSE))","v":{"$error":"#N/A"}},"キメラ忌",{"$f":"MAX(VLOOKUP(キメラA,AV27:BP70,AW26,FALSE),VLOOKUP(キメラB,AV27:BP70,AW26,FALSE))","v":{"$error":"#N/A"}},{"$f":"MAX(VLOOKUP(キメラA,AV27:BP70,AX26,FALSE),VLOOKUP(キメラB,AV27:BP70,AX26,FALSE))","v":{"$error":"#N/A"}},{"$f":"MAX(VLOOKUP(キメラA,AV27:BP70,AY26,FALSE),VLOOKUP(キメラB,AV27:BP70,AY26,FALSE))","v":{"$error":"#N/A"}},{"$f":"MAX(VLOOKUP(キメラA,AV27:BP70,AZ26,FALSE),VLOOKUP(キメラB,AV27:BP70,AZ26,FALSE))","v":{"$error":"#N/A"}},{"$f":"MAX(VLOOKUP(キメラA,AV27:BP70,BA26,FALSE),VLOOKUP(キメラB,AV27:BP70,BA26,FALSE))","v":{"$error":"#N/A"}},{"$f":"ROUNDDOWN(VLOOKUP(キメラA,AV27:BP70,BB26,FALSE)/2+VLOOKUP(キメラB,AV27:BP70,BB26,FALSE)/2,0)","v":{"$error":"#N/A"}},{"$f":"MIN(VLOOKUP(キメラA,AV27:BP70,BC26,FALSE),VLOOKUP(キメラB,AV27:BP70,BC26,FALSE))","v":{"$error":"#N/A"}},{"$f":"MIN(VLOOKUP(キメラA,AV27:BP70,BD26,FALSE),VLOOKUP(キメラB,AV27:BP70,BD26,FALSE))","v":{"$error":"#N/A"}},{"$f":"ROUNDDOWN(VLOOKUP(キメラA,AV27:BP70,BE26,FALSE)/2+VLOOKUP(キメラB,AV27:BP70,BE26,FALSE)/2,0)","v":{"$error":"#N/A"}},{"$f":"ROUNDDOWN(VLOOKUP(キメラA,AV27:BP70,BF26,FALSE)/2+VLOOKUP(キメラB,AV27:BP70,BF26,FALSE)/2,0)","v":{"$error":"#N/A"}},{"$f":"MIN(VLOOKUP(キメラA,AV27:BP70,BG26,FALSE),VLOOKUP(キメラB,AV27:BP70,BG26,FALSE))","v":{"$error":"#N/A"}},{"$f":"MIN(VLOOKUP(キメラA,AV27:BP70,BH26,FALSE),VLOOKUP(キメラB,AV27:BP70,BH26,FALSE))","v":{"$error":"#N/A"}},{"$f":"MIN(VLOOKUP(キメラA,AV27:BP70,BI26,FALSE),VLOOKUP(キメラB,AV27:BP70,BI26,FALSE))","v":{"$error":"#N/A"}},{"$f":"MIN(VLOOKUP(キメラA,AV27:BP70,BJ26,FALSE),VLOOKUP(キメラB,AV27:BP70,BJ26,FALSE))","v":{"$error":"#N/A"}},{"$f":"MIN(VLOOKUP(キメラA,AV27:BP70,BK26,FALSE),VLOOKUP(キメラB,AV27:BP70,BK26,FALSE))","v":{"$error":"#N/A"}},{"$f":"MIN(VLOOKUP(キメラA,AV27:BP70,BL26,FALSE),VLOOKUP(キメラB,AV27:BP70,BL26,FALSE))","v":{"$error":"#N/A"}},{"$f":"MIN(VLOOKUP(キメラA,AV27:BP70,BM26,FALSE),VLOOKUP(キメラB,AV27:BP70,BM26,FALSE))","v":{"$error":"#N/A"}},{"$f":"MIN(VLOOKUP(キメラA,AV27:BP70,BN26,FALSE),VLOOKUP(キメラB,AV27:BP70,BN26,FALSE))","v":{"$error":"#N/A"}},{"$f":"MIN(VLOOKUP(キメラA,AV27:BP70,BO26,FALSE),VLOOKUP(キメラB,AV27:BP70,BO26,FALSE))","v":{"$error":"#N/A"}},{"$f":"MIN(VLOOKUP(キメラA,AV27:BP70,BP26,FALSE),VLOOKUP(キメラB,AV27:BP70,BP26,FALSE))","v":{"$error":"#N/A"}},"キメラ忌",{"$f":"MAX(VLOOKUP(キメラA,BQ27:CK89,BR26,FALSE),VLOOKUP(キメラB,BQ27:CK89,BR26,FALSE))","v":{"$error":"#N/A"}},{"$f":"MAX(VLOOKUP(キメラA,BQ27:CK89,BS26,FALSE),VLOOKUP(キメラB,BQ27:CK89,BS26,FALSE))","v":{"$error":"#N/A"}},{"$f":"MAX(VLOOKUP(キメラA,BQ27:CK89,BT26,FALSE),VLOOKUP(キメラB,BQ27:CK89,BT26,FALSE))","v":{"$error":"#N/A"}},{"$f":"MAX(VLOOKUP(キメラA,BQ27:CK89,BU26,FALSE),VLOOKUP(キメラB,BQ27:CK89,BU26,FALSE))","v":{"$error":"#N/A"}},{"$f":"MAX(VLOOKUP(キメラA,BQ27:CK89,BV26,FALSE),VLOOKUP(キメラB,BQ27:CK89,BV26,FALSE))","v":{"$error":"#N/A"}},{"$f":"ROUNDDOWN(VLOOKUP(キメラA,BQ27:CK89,BW26,FALSE)/2+VLOOKUP(キメラB,BQ27:CK89,BW26,FALSE)/2,0)","v":{"$error":"#N/A"}},{"$f":"MIN(VLOOKUP(キメラA,BQ27:CK89,BX26,FALSE),VLOOKUP(キメラB,BQ27:CK89,BX26,FALSE))","v":{"$error":"#N/A"}},{"$f":"MIN(VLOOKUP(キメラA,BQ27:CK89,BY26,FALSE),VLOOKUP(キメラB,BQ27:CK89,BY26,FALSE))","v":{"$error":"#N/A"}},{"$f":"ROUNDDOWN(VLOOKUP(キメラA,BQ27:CK89,BZ26,FALSE)/2+VLOOKUP(キメラB,BQ27:CK89,BZ26,FALSE)/2,0)","v":{"$error":"#N/A"}},{"$f":"ROUNDDOWN(VLOOKUP(キメラA,BQ27:CK89,CA26,FALSE)/2+VLOOKUP(キメラB,BQ27:CK89,CA26,FALSE)/2,0)","v":{"$error":"#N/A"}},{"$f":"MIN(VLOOKUP(キメラA,BQ27:CK89,CB26,FALSE),VLOOKUP(キメラB,BQ27:CK89,CB26,FALSE))","v":{"$error":"#N/A"}},{"$f":"MIN(VLOOKUP(キメラA,BQ27:CK89,CC26,FALSE),VLOOKUP(キメラB,BQ27:CK89,CC26,FALSE))","v":{"$error":"#N/A"}},{"$f":"MIN(VLOOKUP(キメラA,BQ27:CK89,CD26,FALSE),VLOOKUP(キメラB,BQ27:CK89,CD26,FALSE))","v":{"$error":"#N/A"}},{"$f":"MIN(VLOOKUP(キメラA,BQ27:CK89,CE26,FALSE),VLOOKUP(キメラB,BQ27:CK89,CE26,FALSE))","v":{"$error":"#N/A"}},{"$f":"MIN(VLOOKUP(キメラA,BQ27:CK89,CF26,FALSE),VLOOKUP(キメラB,BQ27:CK89,CF26,FALSE))","v":{"$error":"#N/A"}},{"$f":"MIN(VLOOKUP(キメラA,BQ27:CK89,CG26,FALSE),VLOOKUP(キメラB,BQ27:CK89,CG26,FALSE))","v":{"$error":"#N/A"}},{"$f":"MIN(VLOOKUP(キメラA,BQ27:CK89,CH26,FALSE),VLOOKUP(キメラB,BQ27:CK89,CH26,FALSE))","v":{"$error":"#N/A"}},{"$f":"MIN(VLOOKUP(キメラA,BQ27:CK89,CI26,FALSE),VLOOKUP(キメラB,BQ27:CK89,CI26,FALSE))","v":{"$error":"#N/A"}},{"$f":"MIN(VLOOKUP(キメラA,BQ27:CK89,CJ26,FALSE),VLOOKUP(キメラB,BQ27:CK89,CJ26,FALSE))","v":{"$error":"#N/A"}},{"$f":"MIN(VLOOKUP(キメラA,BQ27:CK89,CK26,FALSE),VLOOKUP(キメラB,BQ27:CK89,CK26,FALSE))","v":{"$error":"#N/A"}},"キメラ忌",{"$f":"MAX(VLOOKUP(キメラA,CL27:DF70,CM26,FALSE),VLOOKUP(キメラB,CL27:DF70,CM26,FALSE))","v":{"$error":"#VALUE!"}},{"$f":"MAX(VLOOKUP(キメラA,CL27:DF70,CN26,FALSE),VLOOKUP(キメラB,CL27:DF70,CN26,FALSE))","v":0},{"$f":"MAX(VLOOKUP(キメラA,CL27:DF70,CO26,FALSE),VLOOKUP(キメラB,CL27:DF70,CO26,FALSE))","v":0},{"$f":"MAX(VLOOKUP(キメラA,CL27:DF70,CP26,FALSE),VLOOKUP(キメラB,CL27:DF70,CP26,FALSE))","v":0},{"$f":"MAX(VLOOKUP(キメラA,CL27:DF70,CQ26,FALSE),VLOOKUP(キメラB,CL27:DF70,CQ26,FALSE))","v":0},{"$f":"ROUNDDOWN(VLOOKUP(キメラA,CL27:DF70,CR26,FALSE)/2+VLOOKUP(キメラB,CL27:DF70,CR26,FALSE)/2,0)","v":0},{"$f":"MIN(VLOOKUP(キメラA,CL27:DF70,CS26,FALSE),VLOOKUP(キメラB,CL27:DF70,CS26,FALSE))","v":0},{"$f":"MIN(VLOOKUP(キメラA,CL27:DF70,CT26,FALSE),VLOOKUP(キメラB,CL27:DF70,CT26,FALSE))","v":0},{"$f":"ROUNDDOWN(VLOOKUP(キメラA,CL27:DF70,CU26,FALSE)/2+VLOOKUP(キメラB,CL27:DF70,CU26,FALSE)/2,0)","v":0},{"$f":"ROUNDDOWN(VLOOKUP(キメラA,CL27:DF70,CV26,FALSE)/2+VLOOKUP(キメラB,CL27:DF70,CV26,FALSE)/2,0)","v":0},{"$f":"MIN(VLOOKUP(キメラA,CL27:DF70,CW26,FALSE),VLOOKUP(キメラB,CL27:DF70,CW26,FALSE))","v":0},{"$f":"MIN(VLOOKUP(キメラA,CL27:DF70,CX26,FALSE),VLOOKUP(キメラB,CL27:DF70,CX26,FALSE))","v":0},{"$f":"MIN(VLOOKUP(キメラA,CL27:DF70,CY26,FALSE),VLOOKUP(キメラB,CL27:DF70,CY26,FALSE))","v":0},{"$f":"MIN(VLOOKUP(キメラA,CL27:DF70,CZ26,FALSE),VLOOKUP(キメラB,CL27:DF70,CZ26,FALSE))","v":0},{"$f":"MIN(VLOOKUP(キメラA,CL27:DF70,DA26,FALSE),VLOOKUP(キメラB,CL27:DF70,DA26,FALSE))","v":0},{"$f":"MIN(VLOOKUP(キメラA,CL27:DF70,DB26,FALSE),VLOOKUP(キメラB,CL27:DF70,DB26,FALSE))","v":0},{"$f":"MIN(VLOOKUP(キメラA,CL27:DF70,DC26,FALSE),VLOOKUP(キメラB,CL27:DF70,DC26,FALSE))","v":0},{"$f":"MIN(VLOOKUP(キメラA,CL27:DF70,DD26,FALSE),VLOOKUP(キメラB,CL27:DF70,DD26,FALSE))","v":0},{"$f":"MIN(VLOOKUP(キメラA,CL27:DF70,DE26,FALSE),VLOOKUP(キメラB,CL27:DF70,DE26,FALSE))","v":0},{"$f":"MIN(VLOOKUP(キメラA,CL27:DF70,DF26,FALSE),VLOOKUP(キメラB,CL27:DF70,DF26,FALSE))","v":0},"キメラ忌",{"$f":"MAX(VLOOKUP(キメラA,DG27:EA70,DH26,FALSE),VLOOKUP(キメラB,DG27:EA70,DH26,FALSE))","v":{"$error":"#N/A"}},{"$f":"MAX(VLOOKUP(キメラA,DG27:EA70,DI26,FALSE),VLOOKUP(キメラB,DG27:EA70,DI26,FALSE))","v":{"$error":"#N/A"}},{"$f":"MAX(VLOOKUP(キメラA,DG27:EA70,DJ26,FALSE),VLOOKUP(キメラB,DG27:EA70,DJ26,FALSE))","v":{"$error":"#N/A"}},{"$f":"MAX(VLOOKUP(キメラA,DG27:EA70,DK26,FALSE),VLOOKUP(キメラB,DG27:EA70,DK26,FALSE))","v":{"$error":"#N/A"}},{"$f":"MAX(VLOOKUP(キメラA,DG27:EA70,DL26,FALSE),VLOOKUP(キメラB,DG27:EA70,DL26,FALSE))","v":{"$error":"#N/A"}},{"$f":"ROUNDDOWN(VLOOKUP(キメラA,DG27:EA70,DM26,FALSE)/2+VLOOKUP(キメラB,DG27:EA70,DM26,FALSE)/2,0)","v":{"$error":"#N/A"}},{"$f":"ROUNDDOWN(VLOOKUP(キメラA,DG27:EA70,DN26,FALSE)/2+VLOOKUP(キメラB,DG27:EA70,DN26,FALSE)/2,0)","v":{"$error":"#N/A"}},{"$f":"ROUNDDOWN(VLOOKUP(キメラA,DG27:EA70,DO26,FALSE)/2+VLOOKUP(キメラB,DG27:EA70,DO26,FALSE)/2,0)","v":{"$error":"#N/A"}},{"$f":"ROUNDDOWN(VLOOKUP(キメラA,DG27:EA70,DP26,FALSE)/2+VLOOKUP(キメラB,DG27:EA70,DP26,FALSE)/2,0)","v":{"$error":"#N/A"}},{"$f":"ROUNDDOWN(VLOOKUP(キメラA,DG27:EA70,DQ26,FALSE)/2+VLOOKUP(キメラB,DG27:EA70,DQ26,FALSE)/2,0)","v":{"$error":"#N/A"}},{"$f":"MIN(VLOOKUP(キメラA,DG27:EA70,DR26,FALSE),VLOOKUP(キメラB,DG27:EA70,DR26,FALSE))","v":{"$error":"#N/A"}},{"$f":"MIN(VLOOKUP(キメラA,DG27:EA70,DS26,FALSE),VLOOKUP(キメラB,DG27:EA70,DS26,FALSE))","v":{"$error":"#N/A"}},{"$f":"MIN(VLOOKUP(キメラA,DG27:EA70,DT26,FALSE),VLOOKUP(キメラB,DG27:EA70,DT26,FALSE))","v":{"$error":"#N/A"}},{"$f":"MIN(VLOOKUP(キメラA,DG27:EA70,DU26,FALSE),VLOOKUP(キメラB,DG27:EA70,DU26,FALSE))","v":{"$error":"#N/A"}},{"$f":"MIN(VLOOKUP(キメラA,DG27:EA70,DV26,FALSE),VLOOKUP(キメラB,DG27:EA70,DV26,FALSE))","v":{"$error":"#N/A"}},{"$f":"MIN(VLOOKUP(キメラA,DG27:EA70,DW26,FALSE),VLOOKUP(キメラB,DG27:EA70,DW26,FALSE))","v":{"$error":"#N/A"}},{"$f":"MIN(VLOOKUP(キメラA,DG27:EA70,DX26,FALSE),VLOOKUP(キメラB,DG27:EA70,DX26,FALSE))","v":{"$error":"#N/A"}},{"$f":"MIN(VLOOKUP(キメラA,DG27:EA70,DY26,FALSE),VLOOKUP(キメラB,DG27:EA70,DY26,FALSE))","v":{"$error":"#N/A"}},{"$f":"MIN(VLOOKUP(キメラA,DG27:EA70,DZ26,FALSE),VLOOKUP(キメラB,DG27:EA70,DZ26,FALSE))","v":{"$error":"#N/A"}},{"$f":"MIN(VLOOKUP(キメラA,DG27:EA70,EA26,FALSE),VLOOKUP(キメラB,DG27:EA70,EA26,FALSE))","v":{"$error":"#N/A"}},"キメラ忌",{"$f":"MAX(VLOOKUP(キメラA,EB27:EV70,EC26,FALSE),VLOOKUP(キメラB,EB27:EV70,EC26,FALSE))","v":{"$error":"#N/A"}},{"$f":"MAX(VLOOKUP(キメラA,EB27:EV70,ED26,FALSE),VLOOKUP(キメラB,EB27:EV70,ED26,FALSE))","v":{"$error":"#N/A"}},{"$f":"MAX(VLOOKUP(キメラA,EB27:EV70,EE26,FALSE),VLOOKUP(キメラB,EB27:EV70,EE26,FALSE))","v":{"$error":"#N/A"}},{"$f":"MAX(VLOOKUP(キメラA,EB27:EV70,EF26,FALSE),VLOOKUP(キメラB,EB27:EV70,EF26,FALSE))","v":{"$error":"#N/A"}},{"$f":"MAX(VLOOKUP(キメラA,EB27:EV70,EG26,FALSE),VLOOKUP(キメラB,EB27:EV70,EG26,FALSE))","v":{"$error":"#N/A"}},{"$f":"ROUNDDOWN(VLOOKUP(キメラA,EB27:EV70,EH26,FALSE)/2+VLOOKUP(キメラB,EB27:EV70,EH26,FALSE)/2,0)","v":{"$error":"#N/A"}},{"$f":"ROUNDDOWN(VLOOKUP(キメラA,EB27:EV70,EI26,FALSE)/2+VLOOKUP(キメラB,EB27:EV70,EI26,FALSE)/2,0)","v":{"$error":"#N/A"}},{"$f":"ROUNDDOWN(VLOOKUP(キメラA,EB27:EV70,EJ26,FALSE)/2+VLOOKUP(キメラB,EB27:EV70,EJ26,FALSE)/2,0)","v":{"$error":"#N/A"}},{"$f":"ROUNDDOWN(VLOOKUP(キメラA,EB27:EV70,EK26,FALSE)/2+VLOOKUP(キメラB,EB27:EV70,EK26,FALSE)/2,0)","v":{"$error":"#N/A"}},{"$f":"ROUNDDOWN(VLOOKUP(キメラA,EB27:EV70,EL26,FALSE)/2+VLOOKUP(キメラB,EB27:EV70,EL26,FALSE)/2,0)","v":{"$error":"#N/A"}},{"$f":"MIN(VLOOKUP(キメラA,EB27:EV70,EM26,FALSE),VLOOKUP(キメラB,EB27:EV70,EM26,FALSE))","v":{"$error":"#N/A"}},{"$f":"MIN(VLOOKUP(キメラA,EB27:EV70,EN26,FALSE),VLOOKUP(キメラB,EB27:EV70,EN26,FALSE))","v":{"$error":"#N/A"}},{"$f":"MIN(VLOOKUP(キメラA,EB27:EV70,EO26,FALSE),VLOOKUP(キメラB,EB27:EV70,EO26,FALSE))","v":{"$error":"#N/A"}},{"$f":"MIN(VLOOKUP(キメラA,EB27:EV70,EP26,FALSE),VLOOKUP(キメラB,EB27:EV70,EP26,FALSE))","v":{"$error":"#N/A"}},{"$f":"MIN(VLOOKUP(キメラA,EB27:EV70,EQ26,FALSE),VLOOKUP(キメラB,EB27:EV70,EQ26,FALSE))","v":{"$error":"#N/A"}},{"$f":"MIN(VLOOKUP(キメラA,EB27:EV70,ER26,FALSE),VLOOKUP(キメラB,EB27:EV70,ER26,FALSE))","v":{"$error":"#N/A"}},{"$f":"MIN(VLOOKUP(キメラA,EB27:EV70,ES26,FALSE),VLOOKUP(キメラB,EB27:EV70,ES26,FALSE))","v":{"$error":"#N/A"}},{"$f":"MIN(VLOOKUP(キメラA,EB27:EV70,ET26,FALSE),VLOOKUP(キメラB,EB27:EV70,ET26,FALSE))","v":{"$error":"#N/A"}},{"$f":"MIN(VLOOKUP(キメラA,EB27:EV70,EU26,FALSE),VLOOKUP(キメラB,EB27:EV70,EU26,FALSE))","v":{"$error":"#N/A"}},{"$f":"MIN(VLOOKUP(キメラA,EB27:EV70,EV26,FALSE),VLOOKUP(キメラB,EB27:EV70,EV26,FALSE))","v":{"$error":"#N/A"}},"キメラ忌",{"$f":"MAX(VLOOKUP(キメラA,EW27:FQ70,EX26,FALSE),VLOOKUP(キメラB,EW27:FQ70,EX26,FALSE))","v":{"$error":"#N/A"}},{"$f":"MAX(VLOOKUP(キメラA,EW27:FQ70,EY26,FALSE),VLOOKUP(キメラB,EW27:FQ70,EY26,FALSE))","v":{"$error":"#N/A"}},{"$f":"MAX(VLOOKUP(キメラA,EW27:FQ70,EZ26,FALSE),VLOOKUP(キメラB,EW27:FQ70,EZ26,FALSE))","v":{"$error":"#N/A"}},{"$f":"MAX(VLOOKUP(キメラA,EW27:FQ70,FA26,FALSE),VLOOKUP(キメラB,EW27:FQ70,FA26,FALSE))","v":{"$error":"#N/A"}},{"$f":"MAX(VLOOKUP(キメラA,EW27:FQ70,FB26,FALSE),VLOOKUP(キメラB,EW27:FQ70,FB26,FALSE))","v":{"$error":"#N/A"}},{"$f":"ROUNDDOWN(VLOOKUP(キメラA,EW27:FQ70,FC26,FALSE)/2+VLOOKUP(キメラB,EW27:FQ70,FC26,FALSE)/2,0)","v":{"$error":"#N/A"}},{"$f":"ROUNDDOWN(VLOOKUP(キメラA,EW27:FQ70,FD26,FALSE)/2+VLOOKUP(キメラB,EW27:FQ70,FD26,FALSE)/2,0)","v":{"$error":"#N/A"}},{"$f":"ROUNDDOWN(VLOOKUP(キメラA,EW27:FQ70,FE26,FALSE)/2+VLOOKUP(キメラB,EW27:FQ70,FE26,FALSE)/2,0)","v":{"$error":"#N/A"}},{"$f":"ROUNDDOWN(VLOOKUP(キメラA,EW27:FQ70,FF26,FALSE)/2+VLOOKUP(キメラB,EW27:FQ70,FF26,FALSE)/2,0)","v":{"$error":"#N/A"}},{"$f":"ROUNDDOWN(VLOOKUP(キメラA,EW27:FQ70,FG26,FALSE)/2+VLOOKUP(キメラB,EW27:FQ70,FG26,FALSE)/2,0)","v":{"$error":"#N/A"}},{"$f":"MIN(VLOOKUP(キメラA,EW27:FQ70,FH26,FALSE),VLOOKUP(キメラB,EW27:FQ70,FH26,FALSE))","v":{"$error":"#N/A"}},{"$f":"MIN(VLOOKUP(キメラA,EW27:FQ70,FI26,FALSE),VLOOKUP(キメラB,EW27:FQ70,FI26,FALSE))","v":{"$error":"#N/A"}},{"$f":"MIN(VLOOKUP(キメラA,EW27:FQ70,FJ26,FALSE),VLOOKUP(キメラB,EW27:FQ70,FJ26,FALSE))","v":{"$error":"#N/A"}},{"$f":"MIN(VLOOKUP(キメラA,EW27:FQ70,FK26,FALSE),VLOOKUP(キメラB,EW27:FQ70,FK26,FALSE))","v":{"$error":"#N/A"}},{"$f":"MIN(VLOOKUP(キメラA,EW27:FQ70,FL26,FALSE),VLOOKUP(キメラB,EW27:FQ70,FL26,FALSE))","v":{"$error":"#N/A"}},{"$f":"MIN(VLOOKUP(キメラA,EW27:FQ70,FM26,FALSE),VLOOKUP(キメラB,EW27:FQ70,FM26,FALSE))","v":{"$error":"#N/A"}},{"$f":"MIN(VLOOKUP(キメラA,EW27:FQ70,FN26,FALSE),VLOOKUP(キメラB,EW27:FQ70,FN26,FALSE))","v":{"$error":"#N/A"}},{"$f":"MIN(VLOOKUP(キメラA,EW27:FQ70,FO26,FALSE),VLOOKUP(キメラB,EW27:FQ70,FO26,FALSE))","v":{"$error":"#N/A"}},{"$f":"MIN(VLOOKUP(キメラA,EW27:FQ70,FP26,FALSE),VLOOKUP(キメラB,EW27:FQ70,FP26,FALSE))","v":{"$error":"#N/A"}},{"$f":"MIN(VLOOKUP(キメラA,EW27:FQ70,FQ26,FALSE),VLOOKUP(キメラB,EW27:FQ70,FQ26,FALSE))","v":{"$error":"#N/A"}},"キメラ忌",{"$f":"MAX(VLOOKUP(キメラA,FR27:GL70,FS26,FALSE),VLOOKUP(キメラB,FR27:GL70,FS26,FALSE))","v":{"$error":"#N/A"}},{"$f":"MAX(VLOOKUP(キメラA,FR27:GL70,FT26,FALSE),VLOOKUP(キメラB,FR27:GL70,FT26,FALSE))","v":{"$error":"#N/A"}},{"$f":"MAX(VLOOKUP(キメラA,FR27:GL70,FU26,FALSE),VLOOKUP(キメラB,FR27:GL70,FU26,FALSE))","v":{"$error":"#N/A"}},{"$f":"MAX(VLOOKUP(キメラA,FR27:GL70,FV26,FALSE),VLOOKUP(キメラB,FR27:GL70,FV26,FALSE))","v":{"$error":"#N/A"}},{"$f":"MAX(VLOOKUP(キメラA,FR27:GL70,FW26,FALSE),VLOOKUP(キメラB,FR27:GL70,FW26,FALSE))","v":{"$error":"#N/A"}},{"$f":"ROUNDDOWN(VLOOKUP(キメラA,FR27:GL70,FX26,FALSE)/2+VLOOKUP(キメラB,FR27:GL70,FX26,FALSE)/2,0)","v":{"$error":"#N/A"}},{"$f":"ROUNDDOWN(VLOOKUP(キメラA,FR27:GL70,FY26,FALSE)/2+VLOOKUP(キメラB,FR27:GL70,FY26,FALSE)/2,0)","v":{"$error":"#N/A"}},{"$f":"ROUNDDOWN(VLOOKUP(キメラA,FR27:GL70,FZ26,FALSE)/2+VLOOKUP(キメラB,FR27:GL70,FZ26,FALSE)/2,0)","v":{"$error":"#N/A"}},{"$f":"ROUNDDOWN(VLOOKUP(キメラA,FR27:GL70,GA26,FALSE)/2+VLOOKUP(キメラB,FR27:GL70,GA26,FALSE)/2,0)","v":{"$error":"#N/A"}},{"$f":"ROUNDDOWN(VLOOKUP(キメラA,FR27:GL70,GB26,FALSE)/2+VLOOKUP(キメラB,FR27:GL70,GB26,FALSE)/2,0)","v":{"$error":"#N/A"}},{"$f":"MIN(VLOOKUP(キメラA,FR27:GL70,GC26,FALSE),VLOOKUP(キメラB,FR27:GL70,GC26,FALSE))","v":{"$error":"#N/A"}},{"$f":"MIN(VLOOKUP(キメラA,FR27:GL70,GD26,FALSE),VLOOKUP(キメラB,FR27:GL70,GD26,FALSE))","v":{"$error":"#N/A"}},{"$f":"MIN(VLOOKUP(キメラA,FR27:GL70,GE26,FALSE),VLOOKUP(キメラB,FR27:GL70,GE26,FALSE))","v":{"$error":"#N/A"}},{"$f":"MIN(VLOOKUP(キメラA,FR27:GL70,GF26,FALSE),VLOOKUP(キメラB,FR27:GL70,GF26,FALSE))","v":{"$error":"#N/A"}},{"$f":"MIN(VLOOKUP(キメラA,FR27:GL70,GG26,FALSE),VLOOKUP(キメラB,FR27:GL70,GG26,FALSE))","v":{"$error":"#N/A"}},{"$f":"MIN(VLOOKUP(キメラA,FR27:GL70,GH26,FALSE),VLOOKUP(キメラB,FR27:GL70,GH26,FALSE))","v":{"$error":"#N/A"}},{"$f":"MIN(VLOOKUP(キメラA,FR27:GL70,GI26,FALSE),VLOOKUP(キメラB,FR27:GL70,GI26,FALSE))","v":{"$error":"#N/A"}},{"$f":"MIN(VLOOKUP(キメラA,FR27:GL70,GJ26,FALSE),VLOOKUP(キメラB,FR27:GL70,GJ26,FALSE))","v":{"$error":"#N/A"}},{"$f":"MIN(VLOOKUP(キメラA,FR27:GL70,GK26,FALSE),VLOOKUP(キメラB,FR27:GL70,GK26,FALSE))","v":{"$error":"#N/A"}},{"$f":"MIN(VLOOKUP(キメラA,FR27:GL70,GL26,FALSE),VLOOKUP(キメラB,FR27:GL70,GL26,FALSE))","v":{"$error":"#N/A"}},"キメラ忌",{"$f":"MAX(VLOOKUP(キメラA,GM27:HG70,GN26,FALSE),VLOOKUP(キメラB,GM27:HG70,GN26,FALSE))","v":{"$error":"#N/A"}},{"$f":"MAX(VLOOKUP(キメラA,GM27:HG70,GO26,FALSE),VLOOKUP(キメラB,GM27:HG70,GO26,FALSE))","v":{"$error":"#N/A"}},{"$f":"MAX(VLOOKUP(キメラA,GM27:HG70,GP26,FALSE),VLOOKUP(キメラB,GM27:HG70,GP26,FALSE))","v":{"$error":"#N/A"}},{"$f":"MAX(VLOOKUP(キメラA,GM27:HG70,GQ26,FALSE),VLOOKUP(キメラB,GM27:HG70,GQ26,FALSE))","v":{"$error":"#N/A"}},{"$f":"MAX(VLOOKUP(キメラA,GM27:HG70,GR26,FALSE),VLOOKUP(キメラB,GM27:HG70,GR26,FALSE))","v":{"$error":"#N/A"}},{"$f":"ROUNDDOWN(VLOOKUP(キメラA,GM27:HG70,GS26,FALSE)/2+VLOOKUP(キメラB,GM27:HG70,GS26,FALSE)/2,0)","v":{"$error":"#N/A"}},{"$f":"ROUNDDOWN(VLOOKUP(キメラA,GM27:HG70,GT26,FALSE)/2+VLOOKUP(キメラB,GM27:HG70,GT26,FALSE)/2,0)","v":{"$error":"#N/A"}},{"$f":"ROUNDDOWN(VLOOKUP(キメラA,GM27:HG70,GU26,FALSE)/2+VLOOKUP(キメラB,GM27:HG70,GU26,FALSE)/2,0)","v":{"$error":"#N/A"}},{"$f":"ROUNDDOWN(VLOOKUP(キメラA,GM27:HG70,GV26,FALSE)/2+VLOOKUP(キメラB,GM27:HG70,GV26,FALSE)/2,0)","v":{"$error":"#N/A"}},{"$f":"ROUNDDOWN(VLOOKUP(キメラA,GM27:HG70,GW26,FALSE)/2+VLOOKUP(キメラB,GM27:HG70,GW26,FALSE)/2,0)","v":{"$error":"#N/A"}},{"$f":"MIN(VLOOKUP(キメラA,GM27:HG70,GX26,FALSE),VLOOKUP(キメラB,GM27:HG70,GX26,FALSE))","v":{"$error":"#N/A"}},{"$f":"MIN(VLOOKUP(キメラA,GM27:HG70,GY26,FALSE),VLOOKUP(キメラB,GM27:HG70,GY26,FALSE))","v":{"$error":"#N/A"}},{"$f":"MIN(VLOOKUP(キメラA,GM27:HG70,GZ26,FALSE),VLOOKUP(キメラB,GM27:HG70,GZ26,FALSE))","v":{"$error":"#N/A"}},{"$f":"MIN(VLOOKUP(キメラA,GM27:HG70,HA26,FALSE),VLOOKUP(キメラB,GM27:HG70,HA26,FALSE))","v":{"$error":"#N/A"}},{"$f":"MIN(VLOOKUP(キメラA,GM27:HG70,HB26,FALSE),VLOOKUP(キメラB,GM27:HG70,HB26,FALSE))","v":{"$error":"#N/A"}},{"$f":"MIN(VLOOKUP(キメラA,GM27:HG70,HC26,FALSE),VLOOKUP(キメラB,GM27:HG70,HC26,FALSE))","v":{"$error":"#N/A"}},{"$f":"MIN(VLOOKUP(キメラA,GM27:HG70,HD26,FALSE),VLOOKUP(キメラB,GM27:HG70,HD26,FALSE))","v":{"$error":"#N/A"}},{"$f":"MIN(VLOOKUP(キメラA,GM27:HG70,HE26,FALSE),VLOOKUP(キメラB,GM27:HG70,HE26,FALSE))","v":{"$error":"#N/A"}},{"$f":"MIN(VLOOKUP(キメラA,GM27:HG70,HF26,FALSE),VLOOKUP(キメラB,GM27:HG70,HF26,FALSE))","v":{"$error":"#N/A"}},{"$f":"MIN(VLOOKUP(キメラA,GM27:HG70,HG26,FALSE),VLOOKUP(キメラB,GM27:HG70,HG26,FALSE))","v":{"$error":"#N/A"}}]
[null,17,null,null,null,"キメラ祝",{"$f":"G50","v":{"$error":"#N/A"}},{"$f":"H50","v":{"$error":"#N/A"}},{"$error":"#N/A"},{"$error":"#N/A"},{"$error":"#N/A"},{"$error":"#N/A"},{"$error":"#N/A"},{"$error":"#N/A"},{"$error":"#N/A"},{"$error":"#N/A"},{"$error":"#N/A"},{"$error":"#N/A"},{"$error":"#N/A"},{"$error":"#N/A"},{"$error":"#N/A"},{"$error":"#N/A"},{"$error":"#N/A"},{"$error":"#N/A"},{"$error":"#N/A"},{"$error":"#N/A"},"キメラ祝",{"$f":"AB50","v":{"$error":"#N/A"}},{"$f":"AC50","v":{"$error":"#N/A"}},{"$error":"#N/A"},{"$error":"#N/A"},{"$error":"#N/A"},{"$error":"#N/A"},{"$error":"#N/A"},{"$error":"#N/A"},{"$error":"#N/A"},{"$error":"#N/A"},{"$error":"#N/A"},{"$error":"#N/A"},{"$error":"#N/A"},{"$error":"#N/A"},{"$error":"#N/A"},{"$error":"#N/A"},{"$error":"#N/A"},{"$error":"#N/A"},{"$error":"#N/A"},{"$error":"#N/A"},"キメラ祝",{"$f":"AW50","v":{"$error":"#N/A"}},{"$f":"AX50","v":{"$error":"#N/A"}},{"$error":"#N/A"},{"$error":"#N/A"},{"$error":"#N/A"},{"$error":"#N/A"},{"$error":"#N/A"},{"$error":"#N/A"},{"$error":"#N/A"},{"$error":"#N/A"},{"$error":"#N/A"},{"$error":"#N/A"},{"$error":"#N/A"},{"$error":"#N/A"},{"$error":"#N/A"},{"$error":"#N/A"},{"$error":"#N/A"},{"$error":"#N/A"},{"$error":"#N/A"},{"$error":"#N/A"},"キメラ祝",{"$f":"BR50","v":{"$error":"#N/A"}},{"$f":"BS50","v":{"$error":"#N/A"}},{"$error":"#N/A"},{"$error":"#N/A"},{"$error":"#N/A"},{"$error":"#N/A"},{"$error":"#N/A"},{"$error":"#N/A"},{"$error":"#N/A"},{"$error":"#N/A"},{"$error":"#N/A"},{"$error":"#N/A"},{"$error":"#N/A"},{"$error":"#N/A"},{"$error":"#N/A"},{"$error":"#N/A"},{"$error":"#N/A"},{"$error":"#N/A"},{"$error":"#N/A"},{"$error":"#N/A"},"キメラ祝",{"$f":"CM50","v":{"$error":"#VALUE!"}},{"$f":"CN50","v":0},0,0,0,0,0,0,0,0,0,0,0,0,0,0,0,0,0,0,"キメラ祝",{"$f":"DH50","v":{"$error":"#N/A"}},{"$f":"DI50","v":{"$error":"#N/A"}},{"$error":"#N/A"},{"$error":"#N/A"},{"$error":"#N/A"},{"$error":"#N/A"},{"$error":"#N/A"},{"$error":"#N/A"},{"$error":"#N/A"},{"$error":"#N/A"},{"$error":"#N/A"},{"$error":"#N/A"},{"$error":"#N/A"},{"$error":"#N/A"},{"$error":"#N/A"},{"$error":"#N/A"},{"$error":"#N/A"},{"$error":"#N/A"},{"$error":"#N/A"},{"$error":"#N/A"},"キメラ祝",{"$f":"EC50","v":{"$error":"#N/A"}},{"$f":"ED50","v":{"$error":"#N/A"}},{"$error":"#N/A"},{"$error":"#N/A"},{"$error":"#N/A"},{"$error":"#N/A"},{"$error":"#N/A"},{"$error":"#N/A"},{"$error":"#N/A"},{"$error":"#N/A"},{"$error":"#N/A"},{"$error":"#N/A"},{"$error":"#N/A"},{"$error":"#N/A"},{"$error":"#N/A"},{"$error":"#N/A"},{"$error":"#N/A"},{"$error":"#N/A"},{"$error":"#N/A"},{"$error":"#N/A"},"キメラ祝",{"$f":"EX50","v":{"$error":"#N/A"}},{"$f":"EY50","v":{"$error":"#N/A"}},{"$error":"#N/A"},{"$error":"#N/A"},{"$error":"#N/A"},{"$error":"#N/A"},{"$error":"#N/A"},{"$error":"#N/A"},{"$error":"#N/A"},{"$error":"#N/A"},{"$error":"#N/A"},{"$error":"#N/A"},{"$error":"#N/A"},{"$error":"#N/A"},{"$error":"#N/A"},{"$error":"#N/A"},{"$error":"#N/A"},{"$error":"#N/A"},{"$error":"#N/A"},{"$error":"#N/A"},"キメラ祝",{"$f":"FS50","v":{"$error":"#N/A"}},{"$f":"FT50","v":{"$error":"#N/A"}},{"$error":"#N/A"},{"$error":"#N/A"},{"$error":"#N/A"},{"$error":"#N/A"},{"$error":"#N/A"},{"$error":"#N/A"},{"$error":"#N/A"},{"$error":"#N/A"},{"$error":"#N/A"},{"$error":"#N/A"},{"$error":"#N/A"},{"$error":"#N/A"},{"$error":"#N/A"},{"$error":"#N/A"},{"$error":"#N/A"},{"$error":"#N/A"},{"$error":"#N/A"},{"$error":"#N/A"},"キメラ祝",{"$f":"GN50","v":{"$error":"#N/A"}},{"$f":"GO50","v":{"$error":"#N/A"}},{"$error":"#N/A"},{"$error":"#N/A"},{"$error":"#N/A"},{"$error":"#N/A"},{"$error":"#N/A"},{"$error":"#N/A"},{"$error":"#N/A"},{"$error":"#N/A"},{"$error":"#N/A"},{"$error":"#N/A"},{"$error":"#N/A"},{"$error":"#N/A"},{"$error":"#N/A"},{"$error":"#N/A"},{"$error":"#N/A"},{"$error":"#N/A"},{"$error":"#N/A"},{"$error":"#N/A"}]
[null,18,null,null,null,null,1,null,null,null,null,null,null,null,null,null,null,null,null,null,null,null,null,null,null,null,null,2,null,null,null,null,null,null,null,null,null,null,null,null,null,null,null,null,null,null,null,null,3,null,null,null,null,null,null,null,null,null,null,null,null,null,null,null,null,null,null,null,null,4,null,null,null,null,null,null,null,null,null,null,null,null,null,null,null,null,null,null,null,null,5,null,null,null,null,null,null,null,null,null,null,null,null,null,null,null,null,null,null,null,null,6,null,null,null,null,null,null,null,null,null,null,null,null,null,null,null,null,null,null,null,null,7,null,null,null,null,null,null,null,null,null,null,null,null,null,null,null,null,null,null,null,null,8,null,null,null,null,null,null,null,null,null,null,null,null,null,null,null,null,null,null,null,null,9,null,null,null,null,null,null,null,null,null,null,null,null,null,null,null,null,null,null,null,null,10]
[null,19]
[null,20,null,null,null,"ｸﾗｽ名","近接","射撃","回避","魔術","抵抗","敏捷","物攻","魔攻","耐久","精神","近","遠","炎","氷","水","雷","風","土","光","闇","クラス特典",null,null,null,null,null,null,null,null,null,null,null,"武器名",null,null,"近接","射撃","回避","魔術","抵抗","敏捷","物攻","魔攻","耐久","精神","近","遠","炎","氷","水","雷","風","土","光","闇","種別","射程","属性","ｺｽﾄ","金額","防具名",null,null,"近接","射撃","回避","魔術","抵抗","敏捷","物攻","魔攻","耐久","精神","近","遠","炎","氷","水","雷","風","土","光","闇","金額","アクセサリ名",null,null,"近接","射撃","回避","魔術","抵抗","敏捷","物攻","魔攻","耐久","精神","近","遠","炎","氷","水","雷","風","土","光","闇","金額",4]
[null,21,null,null,null,"FS",2,2,2,2,1,4,4,3,26,7,0,0,0,0,0,0,0,0,0,0,{"$f":"\"命中判定のC値-1 F値+1 & 炎氷耐性+\"&CS!S10*3","v":"命中判定のC値-1 F値+1 & 炎氷耐性+3"},null,null,null,null,null,null,null,null,null,null,null,"--------近接1--------",null,null,null,null,null,null,null,null,null,null,null,null,null,null,null,null,null,null,null,null,null,null,null,null,null,null,0,"一般服",null,null,null,null,null,null,null,null,null,null,null,null,-10,-10,-10,-10,-10,-10,-10,-10,-10,-10,0,"なし",null,null,null,null,null,null,null,null,null,null,null,null,null,null,null,null,null,null,null,null,null,null,0,4]
[null,null,null,null,null,"FC",2,2,1,2,1,2,3,4,35,8,0,0,0,0,0,0,0,0,0,0,{"$f":"\"氷水雷風土耐性+\"&CS!S10*2&\" & 「BS：凍結」無効\"","v":"氷水雷風土耐性+2 & 「BS：凍結」無効"},null,null,null,null,null,null,null,null,null,null,null,"素手",null,null,-2,null,null,null,null,1,16,null,null,null,-7,-7,null,null,null,null,null,null,null,null,"近接","0-1","近",9,0,"防寒具",null,null,null,null,null,null,null,null,null,null,null,null,-3,-3,-3,null,-3,-3,-3,-3,-3,-3,5,"--------アクセ1--------",null,null,null,null,null,null,null,null,null,null,null,null,null,null,null,null,null,null,null,null,null,null,0,5]
[null,null,null,null,null,"AS",2,1,1,2,2,3,4,6,18,10,0,0,0,0,0,0,0,0,0,0,"「サブアクション」と「オートスキル」の代償-1MP (下限値：1MP)",null,null,null,null,null,null,null,null,null,null,null,"スタンダードソード",null,null,null,null,null,null,null,null,20,null,null,null,3,1,null,null,null,null,null,null,null,null,"近接","0-1","近",9,10,"プレートコート",null,null,null,null,null,null,null,-1,null,null,null,null,4,4,1,1,1,1,1,1,null,null,10,"水晶の指輪",null,null,null,null,null,null,null,null,null,null,null,2,null,null,null,null,null,null,null,null,null,null,10,5]
[null,null,null,null,null,"WR",1,2,3,1,2,4,4,4,17,8,0,0,0,0,0,0,0,0,0,0,{"$f":"\"【敏捷】+\"&IF(CS!S10<=5,CS!S10,5)","v":"【敏捷】+1"},null,null,null,null,null,null,null,null,null,null,null,"レイピア",null,null,-1,null,null,null,null,1,24,null,null,null,2,null,null,null,null,null,null,null,null,null,"近接","0-1","近",9,10,"アイアンメイル",null,null,null,null,-1,null,null,-1,null,null,8,null,9,9,2,2,2,2,2,2,null,null,20,"青銅の小手",null,null,null,null,null,null,null,null,null,null,null,null,4,4,null,null,null,null,null,null,null,null,10,6]
[null,null,null,null,null,"BS",1,2,1,2,3,3,4,4,25,7,0,0,0,0,0,0,0,0,0,0,{"$f":"\"【耐久力】+\"&CS!S10*5&\" & 20カウント毎に【HP】を\"&CS!S10*3&\"点回復。\"","v":"【耐久力】+5 & 20カウント毎に【HP】を3点回復。"},null,null,null,null,null,null,null,null,null,null,null,"バスタードソード",null,null,-2,null,-1,null,null,-1,30,null,3,null,3,2,1,1,1,null,null,null,null,null,"近接","0-1","近",10,10,"ウィンドクロス",null,null,null,null,1,null,null,2,null,null,null,null,-5,-5,-5,-5,-5,-5,null,-5,-5,-5,25,"聖印シール",null,null,null,null,null,null,null,null,null,null,null,null,null,null,null,null,null,null,null,null,null,10,10,6]
[null,null,null,null,null,"VC",2,2,1,2,1,4,4,4,26,9,0,0,0,0,0,0,0,0,0,0,{"$f":"\"【精神力】+\"&CS!S10*2&\" & 「BS：脱力(X)」無効\"","v":"【精神力】+2 & 「BS：脱力(X)」無効"},null,null,null,null,null,null,null,null,null,null,null,"鋼鉄剣 -玉鋼-",null,null,null,null,null,null,null,null,22,null,null,null,4,1,null,null,2,null,1,2,null,null,"近接","0-1","近",9,20,"ハードメイル",null,null,null,null,-1,null,null,-1,null,null,12,null,10,10,3,3,3,3,3,3,1,1,30,"防塵ゴーグル",null,null,null,null,null,null,null,null,null,null,null,null,null,null,null,null,null,null,5,5,null,null,10,7]
[null,null,null,null,null,"TE",2,1,1,2,2,2,4,4,30,8,0,0,0,0,0,0,0,0,0,0,{"$f":"\"「種別：支」のｽｷﾙの代償-1MP & 炎水風土属性の耐性+\"&CS!S10*3","v":"「種別：支」のｽｷﾙの代償-1MP & 炎水風土属性の耐性+3"},null,null,null,null,null,null,null,null,null,null,null,"ブレードシールド",null,null,-1,null,-1,null,-1,null,23,null,3,null,4,4,2,2,1,1,null,3,null,null,"近接","0-1","近",10,25,"マジックインバネス",null,null,null,null,null,null,1,null,null,null,null,2,5,5,null,2,2,null,3,3,2,2,40,"防災頭巾",null,null,null,null,null,null,null,null,null,null,null,null,null,null,10,null,null,null,null,null,null,null,10,7]
[null,null,null,null,null,"TM",2,2,2,1,3,4,4,4,20,11,0,0,0,0,0,0,0,0,0,0,"アイテムコスト-１ & バステを1D6を振って6が出たら無効にする。",null,null,null,null,null,null,null,null,null,null,null,"マジックシールド",null,null,null,null,null,null,1,null,12,3,3,null,7,7,4,4,4,4,4,4,4,4,"近接","0-1","近",10,35,"防弾チョッキ",null,null,null,null,null,null,null,-2,null,null,10,null,9,17,2,2,2,2,2,2,1,1,45,"手袋カイロ",null,null,null,null,null,null,null,null,null,null,null,null,null,null,null,10,null,null,null,null,null,null,10,8]
[null,null,null,null,null,"EE",2,2,1,1,2,3,5,5,31,8,0,0,0,0,0,0,0,0,0,0,"「BS：麻痺」無効。 1セッションに1回判定を振り直しできる。",null,null,null,null,null,null,null,null,null,null,null,"高周波ブレード",null,null,null,null,null,null,-1,null,26,null,null,null,4,3,4,null,null,null,3,null,null,null,"近接","0-1","風",9,40,"カーボンスーツ",null,null,null,null,null,null,null,null,null,null,null,null,11,10,2,1,null,null,2,2,null,null,50,"ニーサポーター",null,null,null,null,null,null,null,null,null,null,3,null,null,null,null,null,null,null,null,null,null,null,10,8]
[null,null,null,null,null,"AB",3,3,1,2,0,3,7,4,23,9,0,0,0,0,0,0,0,0,0,0,{"$f":"\"「BS：封印」無効。【耐久力】+\"&CS!S10*3&\" & 【精神力】+\"&CS!S10","v":"「BS：封印」無効。【耐久力】+3 & 【精神力】+1"},null,null,null,null,null,null,null,null,null,null,null,"パワードナックル",null,null,-1,null,null,null,null,1,30,null,null,null,-3,-3,null,null,null,null,null,null,null,null,"近接","0-1","近",9,45,"シノビスーツ",null,null,null,null,2,null,null,2,null,null,null,null,null,null,3,3,3,3,3,3,null,null,70,"サングラス",null,null,null,null,null,null,null,null,null,null,null,null,null,null,null,null,null,null,null,null,10,null,10,9]
[null,null,null,null,null,"BC",1,1,3,1,3,3,8,8,30,9,0,0,0,0,0,0,0,0,0,0,{"$f":"\"行動順決定時、【敏捷】+\"&10+CS!S10&\" & ｶｳﾝﾄ開始時、後ろのｶｳﾝﾄに配置可能。\"","v":"行動順決定時、【敏捷】+11 & ｶｳﾝﾄ開始時、後ろのｶｳﾝﾄに配置可能。"},null,null,null,null,null,null,null,null,null,null,null,"紫電",null,null,null,null,1,null,null,1,27,null,null,null,-5,-10,null,null,null,8,null,-8,null,null,"近接","0-1","雷",9,65,"マジックプロテクター",null,null,null,null,null,2,null,null,null,null,null,6,3,3,9,9,9,9,9,9,9,9,85,"ミニ避雷針",null,null,null,null,null,null,null,null,null,null,null,null,null,null,null,null,null,10,null,null,null,null,10,9]
[null,null,null,null,null,"PD",1,1,3,1,3,2,3,3,24,12,0,0,0,0,0,0,0,0,0,0,{"$f":"\"〈近〉〈遠〉耐性+\"&CS!S10*2&\" & 「サブアクション」のスキルの射程上限に+1する。\"","v":"〈近〉〈遠〉耐性+2 & 「サブアクション」のスキルの射程上限に+1する。"},null,null,null,null,null,null,null,null,null,null,null,"ウィンドブーメラン",null,null,1,null,null,null,null,1,26,null,null,null,3,1,1,1,null,2,6,null,null,null,"近接","0-2","風",10,90,"エナジーシャツ",null,null,null,null,null,null,null,null,5,null,25,null,15,15,2,2,2,2,2,2,null,null,120,"エアーケープ",null,null,null,null,null,null,null,null,null,null,null,null,null,null,null,2,2,3,3,null,null,null,10,10]
[null,null,null,null,null,"AG",2,2,2,1,1,3,3,3,38,5,0,0,0,0,0,0,0,0,0,0,"「ﾒｲﾝｱｸｼｮﾝ」の代償-1MP(下限：1) 「ｽﾀｰﾄ」のｺｽﾄ-1(下限:2)",null,null,null,null,null,null,null,null,null,null,null,"ドラゴンズブレード",null,null,null,null,null,null,1,2,36,null,null,null,4,2,6,null,6,4,3,3,null,null,"近接","0-1","近",9,120,"ドラゴンアーマー",null,null,null,null,-1,null,null,-2,null,null,null,null,24,22,8,10,2,8,7,1,4,4,160,"ブラッドストーン",null,null,null,null,null,null,null,null,null,null,null,null,null,null,null,null,null,null,null,null,null,null,10,10,"【肉体】+2"]
[null,null,null,null,null,"EB",3,0,2,2,1,3,2,4,28,8,0,0,0,0,0,0,0,0,0,0,"怯み・不動・麻痺・石化・KBを受けるとき、1D10で7以上なら無効",null,null,null,null,null,null,null,null,null,null,null,"--------近接2--------",null,null,null,null,null,null,null,null,null,null,null,null,null,null,null,null,null,null,null,null,null,null,null,null,null,null,0,"パワードスーツ",null,null,null,null,null,null,null,-3,3,null,50,null,24,24,6,4,5,5,6,6,5,5,200,"アズロマラカイト",null,null,null,null,null,null,null,null,null,null,null,null,null,null,null,null,null,null,null,null,null,null,10,11,"【集中】+2"]
[null,null,null,null,null,"OK",2,2,2,2,2,2,3,3,25,10,0,0,0,0,0,0,0,0,0,0,{"$f":"\"感情使用時、HP+[(強度×5)+\"&CS!S10*5&\"] MP+[強度]\"","v":"感情使用時、HP+[(強度×5)+5] MP+[強度]"},null,null,null,null,null,null,null,null,null,null,null,"ヘヴィアックス",null,null,-2,null,null,null,null,null,33,null,null,null,3,3,null,null,null,null,null,null,null,null,"近接","0-1","近",11,10,"チェインフード",null,null,null,null,null,null,null,null,null,null,null,null,2,2,null,null,null,null,null,null,null,null,10,"カーネリアン",null,null,null,null,null,null,null,null,null,null,null,null,null,null,null,null,null,null,null,null,null,null,10,11,"【反射】+2"]
[null,null,null,null,null,"WT",1,2,2,3,1,3,7,7,31,8,0,0,0,0,0,0,0,0,0,0,"12Cまでﾀﾞﾒｰｼﾞ受けない。 命中C値+1 & 回避C値-1(下限値16)",null,null,null,null,null,null,null,null,null,null,null,"ショートソード",null,null,null,null,null,null,null,2,11,null,null,null,1,1,null,null,null,null,null,null,null,null,"近接","0-1","近",9,10,"ハーフアーマー",null,null,null,null,null,null,null,1,null,null,null,null,3,-2,null,null,null,null,null,null,null,null,20,"ソーダライト",null,null,null,null,null,null,null,null,null,null,null,null,null,null,null,null,null,null,null,null,null,null,10,12,"【知識】+2"]
[null,null,null,null,null,"YM",2,2,1,2,2,3,2,2,27,9,0,0,0,0,0,0,0,0,0,0,{"$f":"\"光闇耐性+\"&CS!S10*2&\" & 常時F値-1(下限値4)\"","v":"光闇耐性+2 & 常時F値-1(下限値4)"},null,null,null,null,null,null,null,null,null,null,null,"アイアンシックル",null,null,null,null,-1,null,null,null,27,null,null,null,-3,-3,-3,-3,-3,-3,-3,-3,-3,-3,"近接","0-1","近",10,20,"スペルローブ",null,null,null,null,null,null,null,null,null,null,null,null,3,3,null,null,null,null,null,null,7,7,20,"アマゾナイト",null,null,null,null,null,null,null,null,null,null,null,null,null,null,null,null,null,null,null,null,null,null,10,12,"【幸運】+2"]
[null,null,null,null,null,"TD",1,2,2,3,1,4,3,4,24,10,0,0,0,0,0,0,0,0,0,0,"回避判定のC値-1(下限値16)",null,null,null,null,null,null,null,null,null,null,null,"ロングソード",null,null,-1,null,null,null,null,-1,35,null,null,null,6,null,1,1,1,null,null,null,null,null,"近接","0-2","近",11,25,"リングメイル",null,null,null,null,-1,null,null,-1,null,null,null,null,14,14,3,2,1,1,1,1,null,null,30,"レッドメノウ",null,null,null,null,null,null,null,null,2,null,null,null,null,null,null,null,null,null,null,null,null,null,10,13]
[null,null,null,null,null,"CR",2,2,1,2,1,3,4,4,20,8,0,0,0,0,0,0,0,0,0,0,{"$f":"\"「BS：呪い」「BS：疲労」無効 & 〈炎〉～〈闇〉耐性+\"&CS!S10+2","v":"「BS：呪い」「BS：疲労」無効 & 〈炎〉～〈闇〉耐性+3"},null,null,null,null,null,null,null,null,null,null,null,"鉄槌",null,null,-1,null,-1,null,null,-1,36,null,null,null,3,3,1,1,1,1,1,1,null,null,"近接","0-1","近",12,35,"フェアリーローブ",null,null,null,null,null,null,1,null,null,null,null,3,3,3,null,null,null,null,null,null,null,null,30,"カイヤナイト",null,null,null,null,null,null,null,null,null,2,null,null,null,null,null,null,null,null,null,null,null,null,10,14]
[null,null,null,null,null,"MV",1,2,1,2,3,5,1,1,17,11,0,0,0,0,0,0,0,0,0,0,{"$f":"\"BS付与するとき、代わりに\"&CS!S10+8&\"点の〈無〉属性ﾀﾞﾒｰｼﾞを与えてもよい。\"","v":"BS付与するとき、代わりに9点の〈無〉属性ﾀﾞﾒｰｼﾞを与えてもよい。"},null,null,null,null,null,null,null,null,null,null,null,"マン・ゴーシュ",null,null,null,null,1,null,null,1,20,null,null,null,8,null,-2,-2,-2,null,null,null,null,null,"近接","0-1","近",10,35,"ヘヴィメイル",null,null,null,null,-2,null,null,-2,null,null,15,null,14,16,4,4,4,3,3,3,2,2,35,"フェザーブーツ",null,null,null,null,null,null,null,1,null,null,null,null,null,null,null,null,null,null,null,null,null,null,10,15]
[null,null,null,null,null,"TA",2,2,3,2,0,2,4,3,20,8,0,0,0,0,0,0,0,0,0,0,"ｻﾌﾞｱｸｼｮﾝでｱｲﾃﾑを使用した場合でも、ｻﾌﾞｱｸｼｮﾝのｽｷﾙ使用可。",null,null,null,null,null,null,null,null,null,null,null,"業物：凍河",null,null,null,null,null,null,null,null,28,null,null,null,2,2,-14,14,6,null,null,null,null,null,"近接","0-1","氷",10,50,"マジカルコート",null,null,null,null,null,null,null,null,null,null,null,null,8,6,4,6,5,3,3,4,3,2,40,"スプリングブーツ",null,null,null,null,null,null,null,null,null,null,null,null,null,null,null,null,null,null,null,null,null,null,10,16,"行動順決定の敏捷+4"]
[null,null,null,null,null,"LS",1,3,1,2,1,2,5,3,29,7,0,0,0,0,0,0,0,0,0,0,"自身の攻撃前に1D10を振り、出目が3か4なら攻撃対象の全耐性0。",null,null,null,null,null,null,null,null,null,null,null,"業物：漆黒",null,null,null,null,null,null,null,null,28,null,null,null,2,2,1,1,1,1,1,1,-14,14,"近接","0-1","闇",10,50,"ラバーメイル",null,null,null,null,null,null,null,-1,null,null,8,null,13,13,3,3,3,17,2,2,7,3,50,"--------アクセ2--------",null,null,null,null,null,null,null,null,null,null,null,null,null,null,null,null,null,null,null,null,null,null,0,17,"魔法武器属性を〈炎〉に変更"]
[null,null,null,null,null,"BR",2,0,2,2,2,4,7,7,23,10,0,0,0,0,0,0,0,0,0,0,{"$f":"\"「射程：0-1」の範囲内の対象から受けるダメージ-\"&CL*3+10","v":"「射程：0-1」の範囲内の対象から受けるダメージ-13"},null,null,null,null,null,null,null,null,null,null,null,"アゾット剣",null,null,null,null,null,1,1,1,23,10,null,null,null,null,2,2,2,2,2,2,3,3,"近接","0-1","近",9,60,"バトルフォーム",null,null,1,null,null,null,null,null,3,null,null,null,9,9,-2,1,1,1,-3,1,null,null,50,"マグマーナ",null,null,null,null,null,null,null,null,null,null,null,null,null,null,3,null,null,null,null,null,null,null,10,18,"魔法武器属性を〈氷〉に変更"]
[null,null,null,null,null,"SN",2,2,2,2,0,3,5,5,15,12,0,0,0,0,0,0,0,0,0,0,"攻撃を回避したとき、【MP】を1D6点回復する。",null,null,null,null,null,null,null,null,null,null,null,"スターセイバー",null,null,null,null,null,null,null,null,32,null,null,null,3,3,null,null,null,null,null,null,12,12,"近接","0-1","光",9,75,"カモフラージュセット",null,null,null,1,null,null,null,null,2,null,3,null,10,10,1,2,2,2,2,2,null,null,60,"ブリザリア",null,null,null,null,null,null,null,null,null,null,null,null,null,null,null,3,null,null,null,null,null,null,10,19,"魔法武器属性を〈水〉に変更"]
[null,null,null,null,null,"CP",2,1,1,2,2,1,4,4,14,14,0,0,0,0,0,0,0,0,0,0,"20の倍数ｶｳﾝﾄ終了時、あなたのいるﾏｽに「ﾄﾞｰﾙ」を1体配置する。",null,null,null,null,null,null,null,null,null,null,null,"フレアアックス",null,null,null,null,null,null,null,-2,40,null,5,null,5,5,13,2,-5,null,null,null,null,null,"近接","0-1","炎",9,75,"ワイバーンコート",null,null,null,null,null,null,1,null,4,null,null,3,15,12,11,null,4,11,8,8,7,7,70,"ウェーブリス",null,null,null,null,null,null,null,null,null,null,null,null,null,null,null,null,3,null,null,null,null,null,10,20,"魔法武器属性を〈雷〉に変更"]
[null,null,null,null,null,"SA",2,2,2,1,2,3,5,3,19,9,0,0,0,0,0,0,0,0,0,0,"10の倍数Cごとに、【MP】を[X/2](↓)点回復。X=[現C/10]",null,null,null,null,null,null,null,null,null,null,null,"大業物：皆中",null,null,3,null,null,null,null,null,35,null,null,null,4,4,null,null,null,null,null,null,null,null,"近接","0-1","近",9,100,"ホワイトナイトコート",null,null,null,null,null,null,1,null,null,4,6,null,12,15,null,14,8,6,7,9,5,10,70,"スパーキー",null,null,null,null,null,null,null,null,null,null,null,null,null,null,null,null,null,3,null,null,null,null,10,21,"魔法武器属性を〈風〉に変更"]
[null,null,null,null,null,"FM",0,0,3,3,3,5,0,10,0,15,0,0,0,0,0,0,0,0,0,0,{"$f":"\"【耐久力】-\"&(CL+1)*10&\" 感情強度合計値-2\"","v":"【耐久力】-20 感情強度合計値-2"},null,null,null,null,null,null,null,null,null,null,null,"--------近接3--------",null,null,null,null,null,null,null,null,null,null,null,null,null,null,null,null,null,null,null,null,null,null,null,null,null,null,0,"ブラックヴェーラー",null,null,null,null,1,null,1,null,2,2,4,6,8,8,-8,6,6,null,5,5,-7,7,80,"ストムルム",null,null,null,null,null,null,null,null,null,null,null,null,null,null,null,null,null,null,3,null,null,null,10,22,"魔法武器属性を〈土〉に変更"]
[null,null,null,null,null,"BD",2,0,2,2,3,2,5,5,18,10,0,0,0,0,0,0,0,0,0,0,"5の倍数ｶｳﾝﾄ開始時、4MP ｺｽﾄ0で[ﾊﾞﾘｱ状態]の付与,解除可能。",null,null,null,null,null,null,null,null,null,null,null,"グランドハンマー",null,null,null,null,-1,null,null,-5,38,null,8,null,6,6,null,null,null,null,3,3,null,null,"近接","0-1","土",12,40,"ウェイブメイル",null,null,null,null,1,null,null,null,null,null,10,null,10,10,3,4,9,2,4,5,null,null,80,"マッドネスト",null,null,null,null,null,null,null,null,null,null,null,null,null,null,null,null,null,null,null,3,null,null,10,23,"魔法武器属性を〈光〉に変更"]
[null,null,null,null,null,"ER",2,2,1,2,1,4,6,6,27,8,0,0,0,0,0,0,0,0,0,0,"幻獣が存在する間、判定のC値-1、F値+3。(C値下限16 F値上限9)",null,null,null,null,null,null,null,null,null,null,null,"メタルクロー",null,null,null,null,null,null,null,4,21,null,null,null,10,null,null,null,null,null,null,null,null,null,"近接","0-1","近",10,40,"ブライトドレス",null,null,null,null,null,null,1,-2,null,null,8,4,null,null,null,null,null,null,null,null,12,2,30,"シャイネア",null,null,null,null,null,null,null,null,null,null,null,null,null,null,null,null,null,null,null,null,3,null,10,null,"魔法武器属性を〈闇〉に変更"]
[null,null,null,null,null,"PP",1,2,1,2,3,3,4,7,20,12,0,0,0,0,0,0,0,0,0,0,"「BS：怯み(X)」のXに-1(下限値：1) 「BS：毒(X)」無効。",null,null,null,null,null,null,null,null,null,null,null,"バトルアンブレラ",null,null,null,null,null,null,null,-1,29,null,null,null,3,null,null,null,null,null,null,null,null,null,"近接","0-1","近",10,45,"五芒星の法衣",null,null,null,null,null,1,null,-1,null,null,null,null,null,null,5,5,5,5,5,5,-8,-8,35,"シェイドゥム",null,null,null,null,null,null,null,null,null,null,null,null,null,null,null,null,null,null,null,null,null,3,10,null,"魔法武器属性を〈炎〉に変更"]
[null,null,null,null,null,"AW",2,2,2,2,2,4,5,5,8,8,0,0,0,0,0,0,0,0,0,0,{"$f":"\"1C開始～13C終了間MP代償無視。 & 〈炎〉〈雷〉〈闇〉耐性+\"&CL*3","v":"1C開始～13C終了間MP代償無視。 & 〈炎〉〈雷〉〈闇〉耐性+3"},null,null,null,null,null,null,null,null,null,null,null,"モーニングスター",null,null,null,null,null,null,null,null,28,null,null,null,7,8,1,1,1,1,1,1,3,12,"近接","0-2","光",10,60,"六芒星の法衣",null,null,null,null,null,null,1,-1,null,null,null,null,null,null,-3,-3,-3,-3,-3,-3,16,16,35,"重力石",null,null,1,null,null,null,null,null,null,null,null,null,-4,-4,null,null,null,null,null,null,null,null,20]
[null,null,null,null,null,"WP",1,2,2,2,2,3,5,6,27,7,0,0,0,0,0,0,0,0,0,0,"現在のカウントが偶数の場合、全判定の達成値+1",null,null,null,null,null,null,null,null,null,null,null,"魔断チェーンソー",null,null,null,null,null,null,null,null,40,null,null,null,2,null,null,null,null,null,null,null,null,null,"近接","0-1","近",9,65,"フェザースーツ",null,null,null,null,null,null,null,4,null,null,null,null,1,1,null,null,null,null,8,8,null,null,35,"ポインター",null,null,null,1,null,null,null,null,null,null,null,null,-4,-4,null,null,null,null,null,null,null,null,20]
[null,null,null,null,null,"IA",3,2,2,0,2,4,5,3,30,7,0,0,0,0,0,0,0,0,0,0,{"$f":"\"ｽｷﾙによって武器変更される時、【HP】+\"&ROUNDDOWN(CS!AI41/7,0) &\" 【MP】+\"&2","v":"ｽｷﾙによって武器変更される時、【HP】+23 【MP】+2"},null,null,null,null,null,null,null,null,null,null,null,"スパークスピア",null,null,-1,null,null,null,null,2,40,null,null,null,6,4,2,2,2,13,null,-7,null,null,"近接","0-1","雷",11,70,"呪詛の鎧",null,null,-2,-2,-1,-2,-1,null,12,12,12,12,4,4,5,5,5,3,3,3,null,null,40,"バトルメガネ",null,null,null,null,1,null,null,null,null,null,null,null,-4,-4,null,null,null,null,null,null,null,null,20]
[null,null,null,null,null,"VM",1,1,2,3,2,2,3,7,5,13,0,0,0,0,0,0,0,0,0,0,"「種別：回」のｽｷﾙ効果で自身のHPが回復したとき、1ﾏｽ移動可能",null,null,null,null,null,null,null,null,null,null,null,"サウザンドテイル",null,null,1,null,null,null,null,2,27,null,6,null,3,2,null,null,null,null,null,null,null,null,"近接","0-1","近",10,75,"ライフアーマー",null,null,null,null,null,null,null,-1,null,null,35,3,7,7,null,null,null,null,null,null,4,4,45,"高等魔術書",null,null,null,null,null,1,null,null,null,null,null,null,-4,-4,null,null,null,null,null,null,null,null,20]
[null,null,null,null,null,"SF",2,2,1,2,1,1,7,7,32,10,0,0,0,0,0,0,0,0,0,0,"1ｾｯｼｮﾝ1回、あなたへのBS付与を無効にする。",null,null,null,null,null,null,null,null,null,null,null,"ペンタシールド",null,null,null,null,null,null,1,null,23,null,25,null,8,8,9,9,9,9,null,9,null,null,"近接","0-1","近",13,85,"魔力供給装甲",null,null,null,null,null,null,null,-3,3,3,5,20,7,7,1,1,1,1,1,1,null,null,50,"ディバインピース",null,null,null,null,null,null,1,null,null,null,null,null,-4,-4,null,null,null,null,null,null,null,null,20]
[null,null,null,null,null,"DP",2,2,1,2,2,2,6,3,21,9,0,0,0,0,0,0,0,0,0,0,"1戦闘1回、判定達成値に+15する。その後、「BS：眠り」となる。",null,null,null,null,null,null,null,null,null,null,null,"名刀 -桜花-",null,null,1,null,null,null,null,null,38,null,null,null,13,null,2,2,null,null,4,3,null,null,"近接","0-1","近",11,90,"スカーレットドレス",null,null,null,null,1,null,null,-5,9,9,null,10,11,8,25,8,6,13,13,9,null,null,60,"ダイスストラップ",null,null,null,null,null,null,null,null,null,null,null,null,null,null,null,null,null,null,null,null,null,null,20,null,"ｸﾘﾃｨｶﾙ時の与ダメージ+2D6"]
[null,null,null,null,null,"ZP",1,1,3,1,3,2,6,6,8,14,0,0,0,0,0,0,0,0,0,0,"｢ﾒｲﾝｱｸｼｮﾝ」の行動ｺｽﾄ+1 「対象：自身」以外の射程+1",null,null,null,null,null,null,null,null,null,null,null,"音速槍",null,null,1,null,null,null,null,2,41,null,null,null,4,2,null,null,null,null,null,null,null,null,"近接","0-1","近",9,100,"ティンクルガウン",null,null,null,null,null,null,2,null,null,null,6,6,8,8,7,null,null,7,null,null,7,7,65,"陰陽イヤリング",null,null,null,null,null,null,null,null,null,null,null,null,null,null,null,null,null,null,null,null,8,8,20]
[null,null,null,null,null,"CI",3,1,2,1,2,4,7,3,35,6,0,0,0,0,0,0,0,0,0,0,"最前列にいる時 全達成値+1 それ以外のﾏｽの時 全達成値-1",null,null,null,null,null,null,null,null,null,null,null,"スーパーグローブ",null,null,-1,null,null,null,null,6,50,null,15,null,16,2,1,1,1,1,1,1,4,4,"近接","0-1","近",11,120,"ギアテックコート",null,null,null,null,1,null,2,-6,8,8,35,null,13,17,14,12,-8,-6,13,13,9,9,80,"ゴムヘルメット",null,null,null,null,null,null,null,null,null,null,null,null,null,null,null,null,null,15,null,null,null,null,20]
[null,null,null,null,null,"MA",2,3,1,1,1,2,5,5,25,6,0,0,0,0,0,0,0,0,0,0,{"$f":"\"開始時 機械ｱｲﾃﾑR2回 近遠炎風耐性+\"&CL*6&\" 氷水雷土耐性-\"&CL*6","v":"開始時 機械ｱｲﾃﾑR2回 近遠炎風耐性+6 氷水雷土耐性-6"},null,null,null,null,null,null,null,null,null,null,null,"EXCALIBUR-C",null,null,1,null,1,null,1,3,36,10,15,10,12,6,5,5,3,3,3,4,4,4,"近接","0-1","光",9,140,"ソルジャーメイル",null,null,2,null,null,null,null,-2,null,null,10,null,22,6,12,4,8,null,8,3,6,6,85,"オリヴァイン",null,null,null,null,null,null,null,null,null,null,null,null,null,null,null,null,null,null,null,null,null,null,20]
[null,null,null,null,null,"IS",2,2,3,2,1,1,3,3,40,4,0,0,0,0,0,0,0,0,0,0,{"$f":"\"[準備期間]中、被D\"&CL*5+10&\"点軽減 「種別：支」のｻﾌﾞｽｷﾙでｻﾌﾞ消費なし\"","v":"[準備期間]中、被D15点軽減 「種別：支」のｻﾌﾞｽｷﾙでｻﾌﾞ消費なし"},null,null,null,null,null,null,null,null,null,null,null,"--------射撃1--------",null,null,null,null,null,null,null,null,null,null,null,null,null,null,null,null,null,null,null,null,null,null,null,null,null,null,0,"精霊の鎧",null,null,null,null,1,null,1,1,4,4,null,15,18,17,16,null,16,null,16,16,null,null,100,"四葉ストラップ",null,null,null,null,null,null,null,null,null,null,null,null,null,null,null,1,1,1,2,null,null,null,20,null,"調査C値-1 (下限値：14)"]
[null,null,null,null,null,"LA",1,1,1,1,1,2,2,2,18,8,0,0,0,0,0,0,0,0,0,0,"戦闘中の判定で出目7ならクリティカルになる",null,null,null,null,null,null,null,null,null,null,null,"9mm拳銃",null,null,null,null,null,null,null,1,5,null,null,null,null,null,null,null,null,null,null,null,null,null,"射撃","0-4","遠",9,10,"邪神の鎧",null,null,-1,-1,-3,-1,-3,-6,18,18,38,14,15,14,13,12,14,10,5,5,-8,25,110,"クリアチョーカー",null,null,null,null,null,null,null,null,null,null,null,null,null,null,null,null,null,null,null,null,15,null,20]
[null,null,null,null,null,"MW",2,2,2,2,2,2,3,3,20,10,0,0,0,0,0,0,0,0,0,0,"1戦闘1回、「ﾒｲﾝｱｸｼｮﾝ」ｽｷﾙをコスト9で使用可能",null,null,null,null,null,null,null,null,null,null,null,"ハードボウ",null,null,null,1,null,null,null,-1,5,null,null,null,1,1,null,null,null,null,null,null,null,null,"射撃","2-4","遠","(3)→6",10,"ダイヤモンドアーマー",null,null,null,null,1,null,1,3,null,null,null,null,23,18,7,7,8,9,11,8,14,14,135,"--------アクセ3--------",null,null,null,null,null,null,null,null,null,null,null,null,null,null,null,null,null,null,null,null,null,null,0]
[null,null,null,null,null,null,null,null,null,null,null,null,null,null,null,null,null,null,null,null,null,null,null,null,null,null,null,null,null,null,null,null,null,null,null,null,null,null,"マグナム",null,null,null,null,null,null,null,1,10,null,null,null,null,null,null,null,null,null,null,null,null,null,"射撃","0-4","遠",10,20,null,null,null,null,null,null,null,null,null,null,null,null,null,null,null,null,null,null,null,null,null,null,null,null,"インカローズ",null,null,null,null,null,null,null,null,null,null,null,null,null,null,null,null,null,null,null,null,null,null,20,null,"常時、獲得【BP】に+1"]
[null,null,null,null,null,null,null,null,null,null,null,null,null,null,null,null,null,null,null,null,null,null,null,null,null,null,null,null,null,null,null,null,null,null,null,null,null,null,"ハードボウ弐式",null,null,null,1,null,null,null,-2,10,null,null,null,null,null,null,null,null,null,null,null,null,null,"射撃","2-4","遠","(3)→6",20,null,null,null,null,null,null,null,null,null,null,null,null,null,null,null,null,null,null,null,null,null,null,null,null,"レピドライト",null,null,null,null,null,null,null,null,null,null,null,null,2,null,null,null,null,null,null,null,null,null,20,null,"1ｾｯｼｮﾝ1度、判定振り直し可能"]
[null,null,null,null,null,null,null,null,null,null,null,null,null,null,null,null,null,null,null,null,null,null,null,null,null,null,null,null,null,null,null,null,null,null,null,null,null,null,"エッジヨーヨー",null,null,null,null,null,null,null,1,16,null,null,null,null,null,null,null,null,null,null,null,null,null,"射撃","0-2","遠",9,25,null,null,null,null,null,null,null,null,null,null,null,null,null,null,null,null,null,null,null,null,null,null,null,null,"アイアングローブ",null,null,null,null,null,null,null,-1,null,null,null,null,8,3,null,null,null,null,3,null,null,null,20]
[null,null,null,null,null,null,null,null,null,null,null,null,null,null,null,null,null,null,null,null,null,null,null,null,null,null,null,null,null,null,null,null,null,null,null,null,null,null,"マジック砲 -MC2-",null,null,null,null,null,null,null,null,15,null,null,null,2,2,null,null,null,null,null,null,null,null,"射撃","3-4","遠",10,35,null,null,null,null,null,null,null,null,null,null,null,null,null,null,null,null,null,null,null,null,null,null,null,null,"アイアンヘルム",null,null,null,null,null,null,null,-1,null,null,null,null,8,null,3,3,null,null,null,3,null,null,20]
[null,null,null,null,null,null,null,null,null,null,null,null,null,null,null,null,null,null,null,null,null,null,null,null,null,null,null,null,null,null,null,null,null,null,null,null,null,null,"Mスーパーボール",null,null,null,null,null,null,null,null,16,null,null,null,1,1,null,null,null,null,null,null,null,null,"射撃","0-2","遠",9,40,null,null,null,null,null,null,null,null,null,null,null,null,null,null,null,null,null,null,null,null,null,null,null,null,"アイアンシューズ",null,null,null,null,null,null,null,-1,null,null,null,null,3,8,null,null,3,3,null,null,null,null,20]
[null,null,null,null,null,null,null,null,null,null,null,null,null,null,null,null,null,null,null,null,null,null,null,null,null,null,null,null,null,null,null,null,null,null,null,null,null,null,"魔法手裏剣",null,null,null,1,null,null,null,1,18,null,null,null,null,null,null,null,null,null,3,null,null,null,"射撃","0-3","風",9,60,null,null,null,null,null,null,null,null,null,null,null,null,null,null,null,null,null,null,null,null,null,null,null,null,"フェザーハット",null,null,null,null,null,null,null,null,null,null,null,null,5,5,null,null,null,5,null,null,null,null,20]
[null,null,null,null,null,null,null,null,null,null,null,null,null,null,null,null,null,null,null,null,null,null,null,null,null,null,null,null,null,null,null,null,null,null,null,null,null,null,"小型電磁砲",null,null,null,1,-1,null,null,-1,24,null,null,null,3,3,1,1,1,-5,null,null,null,null,"射撃","2-3","遠",10,70,null,null,null,null,null,null,null,null,null,null,null,null,null,null,null,null,null,null,null,null,null,null,null,null,"パワーベルト",null,null,null,null,null,null,null,null,2,null,null,null,null,null,null,null,null,null,null,null,null,null,20]
[null,null,null,null,null,null,null,null,null,null,null,null,null,null,null,null,null,null,null,null,null,null,null,null,null,null,null,null,null,null,null,null,null,null,null,null,null,null,"SMG",null,null,null,1,null,null,null,null,21,null,null,null,2,2,null,null,null,null,null,null,null,null,"射撃","0-3","遠",9,80,null,null,null,null,null,null,null,null,null,null,null,null,null,null,null,null,null,null,null,null,null,null,null,null,"マジックジュエル",null,null,null,null,null,null,null,null,null,2,null,null,null,null,null,null,null,null,null,null,null,null,20]
[null,null,null,null,null,null,null,null,null,null,null,null,null,null,null,null,null,null,null,null,null,null,null,null,null,null,null,null,null,null,null,null,null,null,null,null,null,null,"レーザーガン.prot",null,null,null,null,null,null,null,null,37,null,null,null,2,null,null,null,null,null,null,null,null,null,"射撃","2-4","遠",10,125,null,null,null,null,null,null,null,null,null,null,null,null,null,null,null,null,null,null,null,null,null,null,null,null,"暗黒の呪石",null,null,null,null,null,null,null,null,null,null,null,2,3,3,null,null,null,null,null,null,12,null,30]
[null,null,null,null,null,null,null,null,null,null,null,null,null,null,null,null,null,null,null,null,null,null,null,null,null,null,null,null,null,null,null,null,null,null,null,null,null,null,"ロケットランチャー",null,null,null,null,-1,null,-1,-3,48,null,null,null,2,2,2,null,null,null,null,null,null,null,"射撃","2-4","遠",12,160,null,null,null,null,null,null,null,null,null,null,null,null,null,null,null,null,null,null,null,null,null,null,null,null,"光翼の指輪",null,null,null,null,null,null,null,null,null,null,null,2,3,3,null,null,null,null,null,null,null,12,30]
[null,null,null,null,null,null,null,null,null,null,null,null,null,null,null,null,null,null,null,null,null,null,null,null,null,null,null,null,null,null,null,null,null,null,null,null,null,null,"--------射撃2--------",null,null,null,null,null,null,null,null,null,null,null,null,null,null,null,null,null,null,null,null,null,null,null,null,null,null,null,null,null,null,null,null,null,null,null,null,null,null,null,null,null,null,null,null,null,null,null,null,null,null,null,"ヴォルテックス",null,null,null,null,null,null,null,null,null,null,null,2,3,3,null,null,null,null,12,null,null,null,30]
[null,null,null,null,null,null,null,null,null,null,null,null,null,null,null,null,null,null,null,null,null,null,null,null,null,null,null,null,null,null,null,null,null,null,null,null,null,null,"スローイングダガー",null,null,null,null,null,null,null,null,8,null,null,null,null,null,null,null,null,null,null,null,null,null,"射撃","0-2","遠",9,10,null,null,null,null,null,null,null,null,null,null,null,null,null,null,null,null,null,null,null,null,null,null,null,null,"スカイヘルム",null,null,null,null,null,null,null,null,null,null,null,null,8,8,4,null,null,null,null,4,null,null,30]
[null,null,null,null,null,null,null,null,null,null,null,null,null,null,null,null,null,null,null,null,null,null,null,null,null,null,null,null,null,null,null,null,null,null,null,null,null,null,"スリングショット",null,null,null,null,null,null,null,null,13,null,null,null,null,null,null,null,null,null,null,null,null,null,"射撃","0-3","遠","(2)→7",10,null,null,null,null,null,null,null,null,null,null,null,null,null,null,null,null,null,null,null,null,null,null,null,null,"スカイグローブ",null,null,null,null,null,null,null,null,null,null,null,null,8,8,null,4,null,4,null,null,null,null,30]
[null,null,null,null,null,null,null,null,null,null,null,null,null,null,null,null,null,null,null,null,null,null,null,null,null,null,null,null,null,null,null,null,null,null,null,null,null,null,"散弾銃",null,null,null,1,-1,null,null,-2,12,null,null,null,null,null,null,null,null,null,null,null,null,null,"射撃","0-4","遠",10,20,null,null,null,null,null,null,null,null,null,null,null,null,null,null,null,null,null,null,null,null,null,null,null,null,"スカイブーツ",null,null,null,null,null,null,null,null,null,null,null,null,8,8,null,null,4,null,4,null,null,null,30]
[null,null,null,null,null,null,null,null,null,null,null,null,null,null,null,null,null,null,null,null,null,null,null,null,null,null,null,null,null,null,null,null,null,null,null,null,null,null,"チャクラム",null,null,null,null,null,null,null,null,14,null,null,null,null,null,null,null,null,null,null,null,null,null,"射撃","0-3","遠","(2)→7",20,null,null,null,null,null,null,null,null,null,null,null,null,null,null,null,null,null,null,null,null,null,null,null,null,"フェアリーガード",null,null,null,null,null,null,null,null,null,null,null,null,null,null,5,5,5,5,5,5,5,4,40]
[null,null,null,null,null,null,null,null,null,null,null,null,null,null,null,null,null,null,null,null,null,null,null,null,null,null,null,null,null,null,null,null,null,null,null,null,null,null,"ワイヤースタンガン",null,null,null,null,null,null,null,null,14,null,null,null,2,2,null,null,null,3,null,null,null,null,"射撃","0-2","雷",10,25,null,null,null,null,null,null,null,null,null,null,null,null,null,null,null,null,null,null,null,null,null,null,null,null,"レッドアンバー",null,null,null,null,null,null,null,null,null,null,null,null,null,null,8,null,null,null,null,null,null,null,40,null,"【肉体】+2 【集中】+2"]
[null,null,null,null,null,null,null,null,null,null,null,null,null,null,null,null,null,null,null,null,null,null,null,null,null,null,null,null,null,null,null,null,null,null,null,null,null,null,"飛苦無",null,null,null,1,null,null,null,null,11,null,null,null,4,null,null,null,null,null,null,null,null,null,"射撃","0-2","遠",9,30,null,null,null,null,null,null,null,null,null,null,null,null,null,null,null,null,null,null,null,null,null,null,null,null,"オニキス",null,null,null,null,null,null,null,null,null,null,null,4,null,null,null,null,null,null,null,null,null,8,40]
[null,null,null,null,null,null,null,null,null,null,null,null,null,null,null,null,null,null,null,null,null,null,null,null,null,null,null,null,null,null,null,null,null,null,null,null,null,null,"四方手裏剣",null,null,null,null,null,null,null,null,17,null,null,null,-3,-3,null,null,null,null,null,null,null,null,"射撃","0-3","遠",9,30,null,null,null,null,null,null,null,null,null,null,null,null,null,null,null,null,null,null,null,null,null,null,null,null,"タンザナイト",null,null,null,null,null,null,null,null,null,null,null,null,null,null,null,null,8,null,null,null,null,null,40,null,"【知性】+3"]
[null,null,null,null,null,null,null,null,null,null,null,null,null,null,null,null,null,null,null,null,null,null,null,null,null,null,null,null,null,null,null,null,null,null,null,null,null,null,"マジック砲 -MC5-",null,null,null,1,null,null,null,null,8,null,null,null,4,4,null,null,null,null,null,null,null,null,"射撃","0-3","風",10,45,null,null,null,null,null,null,null,null,null,null,null,null,null,null,null,null,null,null,null,null,null,null,null,null,"八卦ブレスレット",null,null,null,null,null,null,null,null,null,null,null,null,5,5,5,null,5,5,5,null,null,null,40,null,"【幸運】+1"]
[null,null,null,null,null,null,null,null,null,null,null,null,null,null,null,null,null,null,null,null,null,null,null,null,null,null,null,null,null,null,null,null,null,null,null,null,null,null,"ハイドロガン",null,null,null,null,null,null,null,-1,20,null,null,null,3,3,14,3,3,-5,null,null,null,null,"射撃","0-3","水",10,60,null,null,null,null,null,null,null,null,null,null,null,null,null,null,null,null,null,null,null,null,null,null,null,null,"--------アクセ4--------",null,null,null,null,null,null,null,null,null,null,null,null,null,null,null,null,null,null,null,null,null,null,0]
[null,null,null,null,null,null,null,null,null,null,null,null,null,null,null,null,null,null,null,null,null,null,null,null,null,null,null,null,null,null,null,null,null,null,null,null,null,null,"スナイパーライフル",null,null,null,1,null,null,null,-3,26,null,null,null,3,3,null,null,null,null,null,null,null,null,"射撃","1-4","遠","(4)→8",70,null,null,null,null,null,null,null,null,null,null,null,null,null,null,null,null,null,null,null,null,null,null,null,null,"タロットストラップ",null,null,null,null,null,null,null,null,null,null,null,null,null,null,2,2,2,2,2,2,null,null,50,null,"戦闘開始時ｱﾙｶﾅｶｳﾝﾀｰを1つ得る"]
[null,null,null,null,null,null,null,null,null,null,null,null,null,null,null,null,null,null,null,null,null,null,null,null,null,null,null,null,null,null,null,null,null,null,null,null,null,null,"対物ライフル",null,null,null,1,-1,null,null,-3,31,null,null,null,-4,-4,null,null,null,null,null,null,null,null,"射撃","0-4","遠",11,80,null,null,null,null,null,null,null,null,null,null,null,null,null,null,null,null,null,null,null,null,null,null,null,null,"不吉な呪符",null,null,null,null,null,null,null,null,null,10,null,null,null,null,null,null,null,null,null,null,null,12,50,null,"命中判定F値+2"]
[null,null,null,null,null,null,null,null,null,null,null,null,null,null,null,null,null,null,null,null,null,null,null,null,null,null,null,null,null,null,null,null,null,null,null,null,null,null,"火炎放射器",null,null,null,null,null,null,null,-2,35,null,null,null,3,3,5,5,null,null,null,null,null,null,"射撃","0-2","炎",11,85,null,null,null,null,null,null,null,null,null,null,null,null,null,null,null,null,null,null,null,null,null,null,null,null,"ローラーシューズ",null,null,null,null,null,null,null,null,null,null,null,null,6,3,null,null,null,null,3,null,null,null,60,null,"移動ｺｽﾄ-1 (下限値：1)"]
[null,null,null,null,null,null,null,null,null,null,null,null,null,null,null,null,null,null,null,null,null,null,null,null,null,null,null,null,null,null,null,null,null,null,null,null,null,null,"--------射撃3--------",null,null,null,null,null,null,null,null,null,null,null,null,null,null,null,null,null,null,null,null,null,null,null,null,null,null,null,null,null,null,null,null,null,null,null,null,null,null,null,null,null,null,null,null,null,null,null,null,null,null,null,"アームブースター",null,null,1,null,null,null,null,null,null,null,null,null,null,null,null,null,null,null,null,null,null,null,60,null,"【反射】+1"]
[null,null,null,null,null,null,null,null,null,null,null,null,null,null,null,null,null,null,null,null,null,null,null,null,null,null,null,null,null,null,null,null,null,null,null,null,null,null,"バーナーキャノン",null,null,null,1,null,null,null,-1,17,null,null,null,null,2,8,12,2,2,null,null,null,null,"射撃","0-3","炎",11,40,null,null,null,null,null,null,null,null,null,null,null,null,null,null,null,null,null,null,null,null,null,null,null,null,"ロックコンタクト",null,null,null,1,null,null,null,null,null,null,null,null,null,null,null,null,null,null,null,null,null,null,60,null,"【集中】+1"]
[null,null,null,null,null,null,null,null,null,null,null,null,null,null,null,null,null,null,null,null,null,null,null,null,null,null,null,null,null,null,null,null,null,null,null,null,null,null,"風刃砲",null,null,null,null,null,null,null,1,17,null,null,null,3,3,12,6,7,null,8,null,null,null,"射撃","0-4","風",11,40,null,null,null,null,null,null,null,null,null,null,null,null,null,null,null,null,null,null,null,null,null,null,null,null,"フロートギア",null,null,null,null,1,null,null,null,null,null,null,null,null,null,null,null,null,null,null,null,null,null,60]
[null,null,null,null,null,null,null,null,null,null,null,null,null,null,null,null,null,null,null,null,null,null,null,null,null,null,null,null,null,null,null,null,null,null,null,null,null,null,"フリスピーシールド",null,null,null,null,null,null,null,-2,13,null,8,null,16,14,10,6,6,5,7,7,4,4,"射撃","0-2","遠","(4)→7",45,null,null,null,null,null,null,null,null,null,null,null,null,null,null,null,null,null,null,null,null,null,null,null,null,"ペンタグラム",null,null,null,null,null,1,null,null,null,null,null,null,null,null,2,null,2,2,2,2,null,null,60]
[null,null,null,null,null,null,null,null,null,null,null,null,null,null,null,null,null,null,null,null,null,null,null,null,null,null,null,null,null,null,null,null,null,null,null,null,null,null,"フリーズキャノン",null,null,null,null,-1,null,null,-4,26,null,null,null,5,2,-5,16,8,3,3,3,null,null,"射撃","0-3","氷","(4)→8",50,null,null,null,null,null,null,null,null,null,null,null,null,null,null,null,null,null,null,null,null,null,null,null,null,"アンチマジック",null,null,null,null,null,null,1,null,null,null,null,null,1,1,null,null,null,null,null,null,3,4,60]
[null,null,null,null,null,null,null,null,null,null,null,null,null,null,null,null,null,null,null,null,null,null,null,null,null,null,null,null,null,null,null,null,null,null,null,null,null,null,"レーザーサック",null,null,null,null,null,null,null,null,19,null,null,2,null,null,null,null,null,null,null,null,5,5,"射撃","0-2","光",10,55,null,null,null,null,null,null,null,null,null,null,null,null,null,null,null,null,null,null,null,null,null,null,null,null,"タングステンヘルム",null,null,null,null,null,null,null,null,null,null,null,null,10,10,4,2,3,5,2,4,2,2,70]
[null,null,null,null,null,null,null,null,null,null,null,null,null,null,null,null,null,null,null,null,null,null,null,null,null,null,null,null,null,null,null,null,null,null,null,null,null,null,"マジカルバルカン",null,null,null,1,-1,null,null,-4,24,null,null,3,4,8,3,1,1,1,1,null,null,null,"射撃","0-3","遠",12,60,null,null,null,null,null,null,null,null,null,null,null,null,null,null,null,null,null,null,null,null,null,null,null,null,"太陽の首輪",null,null,null,null,null,null,null,null,7,null,null,null,null,null,14,null,null,null,null,null,null,null,80]
[null,null,null,null,null,null,null,null,null,null,null,null,null,null,null,null,null,null,null,null,null,null,null,null,null,null,null,null,null,null,null,null,null,null,null,null,null,null,"ヴァリアントボウ",null,null,null,1,null,null,null,null,14,null,null,null,4,8,null,null,null,null,null,null,3,3,"射撃","3-4","遠",11,70,null,null,null,null,null,null,null,null,null,null,null,null,null,null,null,null,null,null,null,null,null,null,null,null,"満月の首輪",null,null,null,null,null,null,null,null,null,7,null,null,null,null,null,14,null,null,null,null,null,null,80]
[null,null,null,null,null,null,null,null,null,null,null,null,null,null,null,null,null,null,null,null,null,null,null,null,null,null,null,null,null,null,null,null,null,null,null,null,null,null,"ヘヴィキャノン",null,null,null,-2,-1,null,-1,-3,38,null,null,null,8,4,3,2,2,3,3,3,null,null,"射撃","0-3","遠","(2)→9",80,null,null,null,null,null,null,null,null,null,null,null,null,null,null,null,null,null,null,null,null,null,null,null,null,"流星の首輪",null,null,null,null,null,null,null,4,null,null,null,null,null,null,null,null,null,null,null,null,10,10,80]
[null,null,null,null,null,null,null,null,null,null,null,null,null,null,null,null,null,null,null,null,null,null,null,null,null,null,null,null,null,null,null,null,null,null,null,null,null,null,"ロックブラスター",null,null,null,1,null,null,null,-2,25,null,null,null,11,9,3,4,null,6,7,11,null,null,"射撃","0-3","土","(4)→7",80,null,null,null,null,null,null,null,null,null,null,null,null,null,null,null,null,null,null,null,null,null,null,null,null,"竜王の指輪",null,null,null,null,null,null,null,null,null,null,23,null,null,null,null,null,null,null,null,null,null,null,100]
[null,null,null,null,null,null,null,null,null,null,null,null,null,null,null,null,null,null,null,null,null,null,null,null,null,null,null,null,null,null,null,null,null,null,null,null,null,null,"ブラックボウガン",null,null,null,1,-1,null,null,-4,33,null,10,null,13,11,2,2,2,2,2,2,8,8,"射撃","2-4","遠","(4)→9",95,null,null,null,null,null,null,null,null,null,null,null,null,null,null,null,null,null,null,null,null,null,null,null,null,"大魔女の指輪",null,null,null,null,null,null,null,null,null,null,null,12,null,null,null,null,null,null,null,null,null,null,100]
[null,null,null,null,null,null,null,null,null,null,null,null,null,null,null,null,null,null,null,null,null,null,null,null,null,null,null,null,null,null,null,null,null,null,null,null,null,null,"ショットオプション",null,null,null,1,null,null,null,1,31,null,null,null,8,8,null,null,null,null,null,null,null,null,"射撃","0-4","※",11,135,null,null,null,null,null,null,null,null,null,null,null,null,null,null,null,null,null,null,null,null,null,null,null,null,"混沌の呪印",null,null,null,null,null,null,null,null,11,null,null,null,6,6,null,null,null,null,null,null,10,4,120]
[null,null,null,null,null,null,null,null,null,null,null,null,null,null,null,null,null,null,null,null,null,null,null,null,null,null,null,null,null,null,null,null,null,null,null,null,null,null,"ネオアサルト",null,null,null,2,-1,null,null,-4,41,null,null,null,6,4,null,null,null,null,null,null,null,null,"射撃","0-5","遠",10,180,null,null,null,null,null,null,null,null,null,null,null,null,null,null,null,null,null,null,null,null,null,null,null,null,"ヘキサグラム",null,null,null,null,null,null,null,null,null,11,null,null,null,null,7,5,6,6,5,6,null,null,120]
[null,null,null,null,null,null,null,null,null,null,null,null,null,null,null,null,null,null,null,null,null,null,null,null,null,null,null,null,null,null,null,null,null,null,null,null,null,null,"--------魔法1--------",null,null,null,null,null,null,null,null,null,null,null,null,null,null,null,null,null,null,null,null,null,null,null,null,null,null,null,null,null,null,null,null,null,null,null,null,null,null,null,null,null,null,null,null,null,null,null,null,null,null,null,"レインボーガード",null,null,null,null,null,null,null,null,null,null,null,18,6,6,6,null,6,6,6,6,null,null,150]
[null,null,null,null,null,null,null,null,null,null,null,null,null,null,null,null,null,null,null,null,null,null,null,null,null,null,null,null,null,null,null,null,null,null,null,null,null,null,"スタッフ",null,null,null,null,null,null,null,null,null,8,null,null,null,null,1,1,1,1,1,1,null,null,"魔法","0-3","遠","(3)→7",10,null,null,null,null,null,null,null,null,null,null,null,null,null,null,null,null,null,null,null,null,null,null,null,null,"デビルグローブ",null,null,null,null,null,null,null,null,null,null,null,null,8,8,null,null,4,6,null,4,7,null,150]
[null,null,null,null,null,null,null,null,null,null,null,null,null,null,null,null,null,null,null,null,null,null,null,null,null,null,null,null,null,null,null,null,null,null,null,null,null,null,"マジカルワンド",null,null,null,null,null,1,null,null,null,5,null,null,null,null,1,1,1,1,1,1,null,null,"魔法","0-3","遠","(3)→7",10,null,null,null,null,null,null,null,null,null,null,null,null,null,null,null,null,null,null,null,null,null,null,null,null,"大いなる加護印",null,null,null,null,null,null,null,null,null,null,null,null,null,null,null,6,null,6,6,null,6,13,150]
[null,null,null,null,null,null,null,null,null,null,null,null,null,null,null,null,null,null,null,null,null,null,null,null,null,null,null,null,null,null,null,null,null,null,null,null,null,null,"ファイアロッド",null,null,null,null,null,1,null,null,null,10,null,null,null,null,8,-4,1,1,1,null,null,null,"魔法","0-3","炎","(4)→6",20,null,null,null,null,null,null,null,null,null,null,null,null,null,null,null,null,null,null,null,null,null,null,null,null,"--------限定アクセ--------",null,null,null,null,null,null,null,null,null,null,null,null,null,null,null,null,null,null,null,null,null,null,0]
[null,null,null,null,null,null,null,null,null,null,null,null,null,null,null,null,null,null,null,null,null,null,null,null,null,null,null,null,null,null,null,null,null,null,null,null,null,null,"フリーズロッド",null,null,null,null,null,1,null,null,null,10,null,null,null,null,-4,8,1,1,1,null,null,null,"魔法","0-3","氷","(4)→6",20,null,null,null,null,null,null,null,null,null,null,null,null,null,null,null,null,null,null,null,null,null,null,null,null,"高性能ZPC",null,null,null,null,null,null,null,null,null,null,null,10,null,null,4,null,4,null,4,4,null,null,50,null,"人間限定"]
[null,null,null,null,null,null,null,null,null,null,null,null,null,null,null,null,null,null,null,null,null,null,null,null,null,null,null,null,null,null,null,null,null,null,null,null,null,null,"祝福の杖",null,null,null,null,null,null,null,null,null,16,null,4,null,null,3,3,3,3,3,3,null,null,"魔法","0-2","光","(2)→8",35,null,null,null,null,null,null,null,null,null,null,null,null,null,null,null,null,null,null,null,null,null,null,null,null,"聖なる光輪",null,null,null,null,null,null,2,null,null,null,null,null,9,9,null,null,null,null,null,null,18,null,50,null,"天使限定"]
[null,null,null,null,null,null,null,null,null,null,null,null,null,null,null,null,null,null,null,null,null,null,null,null,null,null,null,null,null,null,null,null,null,null,null,null,null,null,"ガードロッド",null,null,null,null,null,1,null,-2,null,12,null,null,3,3,4,2,3,1,2,2,1,1,"魔法","0-3","遠","(4)→6",40,null,null,null,null,null,null,null,null,null,null,null,null,null,null,null,null,null,null,null,null,null,null,null,null,"漆黒のグローブ",null,null,null,null,null,null,2,null,null,null,null,null,5,5,3,3,3,3,null,null,null,18,50,null,"悪魔限定"]
[null,null,null,null,null,null,null,null,null,null,null,null,null,null,null,null,null,null,null,null,null,null,null,null,null,null,null,null,null,null,null,null,null,null,null,null,null,null,"アンプリファー",null,null,null,null,-1,null,null,null,null,21,null,null,1,1,-2,-2,-2,-2,-2,-2,-3,-3,"魔法","0-3","近","(3)→11",50,null,null,null,null,null,null,null,null,null,null,null,null,null,null,null,null,null,null,null,null,null,null,null,null,"フェアリーバングル",null,null,null,null,null,null,null,null,null,null,null,null,null,null,5,5,5,5,5,5,3,3,50,null,"妖精限定 感情の強度の合計値上限+1"]
[null,null,null,null,null,null,null,null,null,null,null,null,null,null,null,null,null,null,null,null,null,null,null,null,null,null,null,null,null,null,null,null,null,null,null,null,null,null,"天雷杖",null,null,null,null,null,null,null,2,null,16,null,null,null,null,null,null,null,10,null,-5,null,null,"魔法","3-3","雷","(3)→8",60,null,null,null,null,null,null,null,null,null,null,null,null,null,null,null,null,null,null,null,null,null,null,null,null,"ソニックフェザー",null,null,null,null,null,null,null,3,null,null,null,null,2,2,null,null,null,null,16,null,null,null,50,null,"鳥人限定"]
[null,null,null,null,null,null,null,null,null,null,null,null,null,null,null,null,null,null,null,null,null,null,null,null,null,null,null,null,null,null,null,null,null,null,null,null,null,null,"WPリング",null,null,null,null,1,1,null,2,null,22,null,null,3,null,1,1,1,1,6,null,null,null,"魔法","0-3","風","(2)→11",75,null,null,null,null,null,null,null,null,null,null,null,null,null,null,null,null,null,null,null,null,null,null,null,null,"先祖の竜爪",null,null,null,null,null,null,null,null,null,null,null,null,4,4,4,4,4,4,4,4,4,4,50,null,"竜人限定 加護属性の与ﾀﾞﾒｰｼﾞ+7"]
[null,null,null,null,null,null,null,null,null,null,null,null,null,null,null,null,null,null,null,null,null,null,null,null,null,null,null,null,null,null,null,null,null,null,null,null,null,null,"スターティンクル",null,null,null,null,null,1,null,1,null,31,null,3,1,1,2,2,2,2,4,null,7,null,"魔法","0-2","光","(4)→9",85,null,null,null,null,null,null,null,null,null,null,null,null,null,null,null,null,null,null,null,null,null,null,null,null,"スピアピアス",null,null,null,null,null,null,null,null,null,null,15,null,3,3,null,null,null,null,5,5,null,null,50,null,"獣人限定 【反射】+4"]
[null,null,null,null,null,null,null,null,null,null,null,null,null,null,null,null,null,null,null,null,null,null,null,null,null,null,null,null,null,null,null,null,null,null,null,null,null,null,"アーススタッフ",null,null,null,null,null,1,null,null,null,35,null,null,3,1,2,2,2,null,null,5,null,null,"魔法","0-3","土","(5)→9",90,null,null,null,null,null,null,null,null,null,null,null,null,null,null,null,null,null,null,null,null,null,null,null,null,"紅の宝玉",null,null,null,null,null,null,null,null,null,null,20,null,null,null,null,null,null,null,null,null,null,10,50,null,"吸血鬼限定 【肉体】+3"]
[null,null,null,null,null,null,null,null,null,null,null,null,null,null,null,null,null,null,null,null,null,null,null,null,null,null,null,null,null,null,null,null,null,null,null,null,null,null,"ディープロッド",null,null,null,null,1,1,1,null,null,48,null,3,2,2,8,4,8,-10,null,null,null,null,"魔法","0-4","水","(4)→10",130,null,null,null,null,null,null,null,null,null,null,null,null,null,null,null,null,null,null,null,null,null,null,null,null,"真なる証",null,null,null,null,null,null,null,null,null,null,null,null,null,null,null,null,null,null,null,null,null,null,50,null,"偽人限定 [解放状態]での与ﾀﾞﾒｰｼﾞ+10"]
[null,null,null,null,null,null,null,null,null,null,null,null,null,null,null,null,null,null,null,null,null,null,null,null,null,null,null,null,null,null,null,null,null,null,null,null,null,null,"--------魔法2--------",null,null,null,null,null,null,null,null,null,null,null,null,null,null,null,null,null,null,null,null,null,null,null,null,null,null,null,null,null,null,null,null,null,null,null,null,null,null,null,null,null,null,null,null,null,null,null,null,null,null,null,"人造装甲",null,null,null,null,null,null,null,null,null,null,null,null,9,9,5,5,5,5,3,3,3,3,50,null,"魔法人形限定"]
[null,null,null,null,null,null,null,null,null,null,null,null,null,null,null,null,null,null,null,null,null,null,null,null,null,null,null,null,null,null,null,null,null,null,null,null,null,null,"マジックグローブ",null,null,null,null,null,null,null,null,null,10,null,null,null,null,null,null,null,null,null,null,null,null,"魔法","0-3","遠","(2)→8",10,null,null,null,null,null,null,null,null,null,null,null,null,null,null,null,null,null,null,null,null,null,null,null,null,"デスサイズウェイト",null,null,null,null,null,null,null,null,5,5,null,null,null,null,3,3,3,3,null,null,null,5,50,null,"死神限定"]
[null,null,null,null,null,null,null,null,null,null,null,null,null,null,null,null,null,null,null,null,null,null,null,null,null,null,null,null,null,null,null,null,null,null,null,null,null,null,"スペルオーブ",null,null,null,null,null,null,null,null,null,7,null,null,-3,-3,1,1,1,1,1,1,null,null,"魔法","0-3","遠","(3)→6",10,null,null,null,null,null,null,null,null,null,null,null,null,null,null,null,null,null,null,null,null,null,null,null,null,"神聖神器",null,null,null,null,null,null,null,null,null,null,null,6,null,null,2,2,2,2,2,2,11,11,50,null,"神格限定"]
[null,null,null,null,null,null,null,null,null,null,null,null,null,null,null,null,null,null,null,null,null,null,null,null,null,null,null,null,null,null,null,null,null,null,null,null,null,null,"サンダーロッド",null,null,null,null,null,1,null,null,null,10,null,null,null,null,null,1,1,8,1,-4,null,null,"魔法","0-3","雷","(4)→6",20,null,null,null,null,null,null,null,null,null,null,null,null,null,null,null,null,null,null,null,null,null,null,null,null,"妖懐石",null,null,null,null,null,null,null,null,null,null,null,null,3,3,3,3,3,3,3,3,3,3,50,null,"妖怪限定 感情の強度合計値上限+1"]
[null,null,null,null,null,null,null,null,null,null,null,null,null,null,null,null,null,null,null,null,null,null,null,null,null,null,null,null,null,null,null,null,null,null,null,null,null,null,"ウェイブロッド",null,null,null,null,null,1,null,null,null,10,null,null,null,null,null,1,8,-4,1,1,null,null,"魔法","0-3","水","(4)→6",20,null,null,null,null,null,null,null,null,null,null,null,null,null,null,null,null,null,null,null,null,null,null,null,null,"Fアリスバンド",null,null,null,null,null,null,null,null,null,null,null,null,null,4,-5,3,3,3,3,3,5,null,50,null,"花姫限定 戦闘開始時にﾌﾗﾜｰｶｳﾝﾀｰを1つ得る"]
[null,null,null,null,null,null,null,null,null,null,null,null,null,null,null,null,null,null,null,null,null,null,null,null,null,null,null,null,null,null,null,null,null,null,null,null,null,null,"ホーリーワンド",null,null,null,null,null,null,1,null,null,10,null,3,2,2,null,null,null,null,null,null,null,null,"魔法","0-2","光","(4)→6",40,null,null,null,null,null,null,null,null,null,null,null,null,null,null,null,null,null,null,null,null,null,null,null,null,"複眼ゴーグル",null,null,null,null,1,null,null,null,null,null,null,null,5,5,8,null,null,null,-6,-6,null,null,50,null,"虫人限定"]
[null,null,null,null,null,null,null,null,null,null,null,null,null,null,null,null,null,null,null,null,null,null,null,null,null,null,null,null,null,null,null,null,null,null,null,null,null,null,"イービルワンド",null,null,null,null,null,null,null,null,null,18,null,null,null,null,null,null,null,null,null,null,-16,8,"魔法","0-3","闇","(3)→7",40,null,null,null,null,null,null,null,null,null,null,null,null,null,null,null,null,null,null,null,null,null,null,null,null,"ルーンマスク",null,null,null,null,null,null,null,null,null,null,null,13,11,11,6,null,null,6,null,null,5,5,50,null,"戦乙女限定 感情の強度の合計値上限-2"]
[null,null,null,null,null,null,null,null,null,null,null,null,null,null,null,null,null,null,null,null,null,null,null,null,null,null,null,null,null,null,null,null,null,null,null,null,null,null,"ジュエルスタッフ",null,null,null,null,null,2,null,null,null,10,null,null,null,null,null,null,null,null,null,null,null,null,"魔法","0-3","近","(3)→9",55,null,null,null,null,null,null,null,null,null,null,null,null,null,null,null,null,null,null,null,null,null,null,null,null,"アクアリング",null,null,null,null,null,null,null,null,null,null,null,7,null,null,7,7,7,-5,5,5,null,null,50,null,"半魚人限定 《ｳｫｰﾀｰﾜｰﾙﾄﾞ》の代償に-1BP"]
[null,null,null,null,null,null,null,null,null,null,null,null,null,null,null,null,null,null,null,null,null,null,null,null,null,null,null,null,null,null,null,null,null,null,null,null,null,null,"氷華杖",null,null,null,null,null,null,1,-1,null,19,null,null,2,2,-10,14,6,null,null,null,null,null,"魔法","2-3","氷","(3)→7",60,null,null,null,null,null,null,null,null,null,null,null,null,null,null,null,null,null,null,null,null,null,null,null,null,"マジカルハット",null,null,null,null,null,null,null,null,null,null,null,6,null,null,3,3,3,3,3,3,6,6,50,null,"魔道士限定 【知識】+3"]
[null,null,null,null,null,null,null,null,null,null,null,null,null,null,null,null,null,null,null,null,null,null,null,null,null,null,null,null,null,null,null,null,null,null,null,null,null,null,"魔法剣",null,null,null,null,null,null,null,null,15,20,null,null,6,6,2,2,2,2,2,2,null,null,"魔法","0-3","近",12,70,null,null,null,null,null,null,null,null,null,null,null,null,null,null,null,null,null,null,null,null,null,null,null,null,"付喪根付",null,null,null,null,null,null,null,null,null,null,null,null,6,6,2,2,2,2,2,2,null,null,50,null,"付喪神限定 命中F値-2 (下限値：3)"]
[null,null,null,null,null,null,null,null,null,null,null,null,null,null,null,null,null,null,null,null,null,null,null,null,null,null,null,null,null,null,null,null,null,null,null,null,null,null,"ディバインロッド",null,null,null,null,null,1,2,null,null,17,null,3,3,3,null,null,null,null,null,null,4,16,"魔法","0-2","光","(4)→6",90,null,null,null,null,null,null,null,null,null,null,null,null,null,null,null,null,null,null,null,null,null,null,null,null,"メモリーレリック",null,null,null,null,null,null,null,null,null,null,null,10,4,4,2,2,2,2,2,2,2,2,50,null,"幽体限定"]
[null,null,null,null,null,null,null,null,null,null,null,null,null,null,null,null,null,null,null,null,null,null,null,null,null,null,null,null,null,null,null,null,null,null,null,null,null,null,"クリスタルロッド",null,null,null,null,null,1,null,null,null,30,null,null,null,null,3,3,3,3,3,3,3,3,"魔法","0-3","遠","(2)→8",90,null,null,null,null,null,null,null,null,null,null,null,null,null,null,null,null,null,null,null,null,null,null,null,null,"鬼の角",null,null,null,null,null,null,null,null,null,null,25,null,6,6,2,2,2,2,2,2,null,null,50,null,"鬼限定"]
[null,null,null,null,null,null,null,null,null,null,null,null,null,null,null,null,null,null,null,null,null,null,null,null,null,null,null,null,null,null,null,null,null,null,null,null,null,null,"エクリプスデイ",null,null,null,null,null,2,2,null,null,40,null,10,5,5,3,3,3,3,3,3,8,8,"魔法","0-4","※","(4)→8",120,null,null,null,null,null,null,null,null,null,null,null,null,null,null,null,null,null,null,null,null,null,null,null,null,"テイルリング",null,null,null,null,null,null,null,null,null,null,10,null,7,7,6,6,null,null,null,null,null,null,50,null,"爬虫人限定 回避F値-2 (下限値：3)"]
[null,null,null,null,null,null,null,null,null,null,null,null,null,null,null,null,null,null,null,null,null,null,null,null,null,null,null,null,null,null,null,null,null,null,null,null,null,null,"--------魔法3--------",null,null,null,null,null,null,null,null,null,null,null,null,null,null,null,null,null,null,null,null,null,null,null,null,null,null,null,null,null,null,null,null,null,null,null,null,null,null,null,null,null,null,null,null,null,null,null,null,null,null,null,"--------ｸﾗｽ限定ｱｸｾ--------",null,null,null,null,null,null,null,null,null,null,null,null,null,null,null,null,null,null,null,null,null,null,0]
[null,null,null,null,null,null,null,null,null,null,null,null,null,null,null,null,null,null,null,null,null,null,null,null,null,null,null,null,null,null,null,null,null,null,null,null,null,null,"グリモワール",null,null,null,null,null,1,null,null,null,null,null,null,null,null,-5,null,null,null,null,null,null,null,"魔法","0-3","遠","(4)→6",5,null,null,null,null,null,null,null,null,null,null,null,null,null,null,null,null,null,null,null,null,null,null,null,null,"ファイアローズ",null,null,null,null,null,null,null,null,null,null,null,null,4,4,9,7,-5,null,null,null,5,null,40,null,"FS限定 命中F値-1 (下限値：4)"]
[null,null,null,null,null,null,null,null,null,null,null,null,null,null,null,null,null,null,null,null,null,null,null,null,null,null,null,null,null,null,null,null,null,null,null,null,null,null,"強化対魔護符",null,null,null,null,null,null,null,null,null,8,null,5,4,3,null,null,null,null,null,null,6,6,"魔法","0-3","遠","(3)→8",15,null,null,null,null,null,null,null,null,null,null,null,null,null,null,null,null,null,null,null,null,null,null,null,null,"スノークリスタル",null,null,null,null,1,null,1,null,null,null,null,null,2,2,-4,8,3,null,null,null,null,null,40,null,"FC限定"]
[null,null,null,null,null,null,null,null,null,null,null,null,null,null,null,null,null,null,null,null,null,null,null,null,null,null,null,null,null,null,null,null,null,null,null,null,null,null,"魔笛",null,null,null,null,null,1,null,null,null,13,null,null,2,2,null,null,null,null,-3,-3,null,null,"魔法","0-4","遠","(5)→7",20,null,null,null,null,null,null,null,null,null,null,null,null,null,null,null,null,null,null,null,null,null,null,null,null,"アルカナカード",null,null,null,null,null,null,null,null,null,null,null,null,-4,-4,null,null,null,null,null,null,null,null,40,null,"AS限定 戦闘開始時ｱﾙｶﾅｶｳﾝﾀｰを1つ得る"]
[null,null,null,null,null,null,null,null,null,null,null,null,null,null,null,null,null,null,null,null,null,null,null,null,null,null,null,null,null,null,null,null,null,null,null,null,null,null,"アンテナメット",null,null,null,null,null,1,null,null,null,19,null,null,2,2,null,null,null,-10,null,null,null,null,"魔法","0-3","近","(3)→7",50,null,null,null,null,null,null,null,null,null,null,null,null,null,null,null,null,null,null,null,null,null,null,null,null,"タイフーンリスト",null,null,null,null,null,null,null,2,null,null,null,null,null,null,null,null,null,null,10,2,null,null,40,null,"WR限定 装備武器属性を風にする"]
[null,null,null,null,null,null,null,null,null,null,null,null,null,null,null,null,null,null,null,null,null,null,null,null,null,null,null,null,null,null,null,null,null,null,null,null,null,null,"ダークチョーカー",null,null,null,null,null,1,null,null,null,18,null,4,3,3,4,4,4,4,4,4,12,12,"魔法","0-2","闇","(3)→13",50,null,null,null,null,null,null,null,null,null,null,null,null,null,null,null,null,null,null,null,null,null,null,null,null,"ブラッディリング",null,null,null,null,null,null,null,null,null,null,null,null,null,10,null,null,null,null,null,null,null,4,40,null,"BS限定 呪印の持続ｶｳﾝﾄを25にする"]
[null,null,null,null,null,null,null,null,null,null,null,null,null,null,null,null,null,null,null,null,null,null,null,null,null,null,null,null,null,null,null,null,null,null,null,null,null,null,"ラッキーペンダント",null,null,null,null,null,1,null,1,null,11,null,null,3,3,null,null,null,null,null,null,null,null,"魔法","0-3","近",15,85,null,null,null,null,null,null,null,null,null,null,null,null,null,null,null,null,null,null,null,null,null,null,null,null,"ブラックピアス",null,null,null,null,null,null,null,null,null,null,null,null,null,null,null,null,null,null,null,null,null,8,40,null,"VC限定 1ｾｯｼｮﾝ1度、攻撃属性を無属性に変更"]
[null,null,null,null,null,null,null,null,null,null,null,null,null,null,null,null,null,null,null,null,null,null,null,null,null,null,null,null,null,null,null,null,null,null,null,null,null,null,"神秘の光球",null,null,null,null,null,1,1,null,null,14,null,3,3,3,4,4,4,4,4,4,10,15,"魔法","0-3","光","(3)→9",90,null,null,null,null,null,null,null,null,null,null,null,null,null,null,null,null,null,null,null,null,null,null,null,null,"ロンバスリング",null,null,null,null,null,null,null,null,null,null,null,5,null,null,null,null,null,null,null,null,null,null,40,null,"TE限定 専攻属性の耐性に+12"]
[null,null,null,null,null,null,null,null,null,null,null,null,null,null,null,null,null,null,null,null,null,null,null,null,null,null,null,null,null,null,null,null,null,null,null,null,null,null,"ゼロポインター",null,null,null,null,null,1,null,null,null,13,null,3,5,5,4,4,4,4,4,4,4,4,"魔法","0-4","遠","(4)→10",95,null,null,null,null,null,null,null,null,null,null,null,null,null,null,null,null,null,null,null,null,null,null,null,null,"トリックキット",null,null,null,null,null,null,null,null,null,null,null,null,6,6,null,null,null,null,null,null,null,null,40,null,"TM限定 戦闘開始時にﾄﾘｯｸｶｳﾝﾀｰを1つ得る"]
[null,null,null,null,null,null,null,null,null,null,null,null,null,null,null,null,null,null,null,null,null,null,null,null,null,null,null,null,null,null,null,null,null,null,null,null,null,null,"ワープブレスレット",null,null,null,null,null,null,null,2,null,31,null,null,2,2,-10,14,6,null,null,null,null,null,"魔法","2-3","遠","(3)→7",95,null,null,null,null,null,null,null,null,null,null,null,null,null,null,null,null,null,null,null,null,null,null,null,null,"プラズマコード",null,null,null,null,null,null,null,null,null,null,null,null,4,4,2,2,2,10,-3,2,2,2,40,null,"EE限定 1ｾｯｼｮﾝ1回 自身の判定を振りなおす"]
[null,null,null,null,null,null,null,null,null,null,null,null,null,null,null,null,null,null,null,null,null,null,null,null,null,null,null,null,null,null,null,null,null,null,null,null,null,null,"轟雷のアミュレット",null,null,null,null,1,null,1,3,null,26,null,6,2,2,null,null,null,13,null,-8,null,null,"魔法","0-3","雷",13,105,null,null,null,null,null,null,null,null,null,null,null,null,null,null,null,null,null,null,null,null,null,null,null,null,"アトミックウォッチ",null,null,null,null,null,null,null,null,null,null,null,null,null,null,9,null,null,null,null,null,7,null,40,null,"AB限定 命中F値-2 (下限値：3)"]
[null,null,null,null,null,null,null,null,null,null,null,null,null,null,null,null,null,null,null,null,null,null,null,null,null,null,null,null,null,null,null,null,null,null,null,null,null,null,"インフィニティロッド",null,null,-2,-2,1,-4,2,-3,null,33,null,11,7,7,3,3,3,3,3,3,2,2,"魔法","0-2","遠","(3)→11",130,null,null,null,null,null,null,null,null,null,null,null,null,null,null,null,null,null,null,null,null,null,null,null,null,"リーダーズバッジ",null,null,null,null,null,null,null,3,3,null,null,null,3,3,null,null,null,null,null,null,null,null,40,null,"BC限定"]
[null,null,null,null,null,null,null,null,null,null,null,null,null,null,null,null,null,null,null,null,null,null,null,null,null,null,null,null,null,null,null,null,null,null,null,null,null,null,"七色の法典",null,null,null,null,1,2,1,2,null,35,null,null,5,5,7,7,7,7,7,7,7,7,"魔法","0-3","風","(7)→7",140,null,null,null,null,null,null,null,null,null,null,null,null,null,null,null,null,null,null,null,null,null,null,null,null,"パルスセンサー",null,null,null,null,null,null,null,null,null,null,null,null,2,2,2,2,2,2,2,2,2,2,40,null,"PD限定 全てのスキルに「種別：音」を追加"]
[null,null,null,null,null,null,null,null,null,null,null,null,null,null,null,null,null,null,null,null,null,null,null,null,null,null,null,null,null,null,null,null,null,null,null,null,null,null,"--------限定--------",null,null,null,null,null,null,null,null,null,null,null,null,null,null,null,null,null,null,null,null,null,null,null,null,null,null,null,null,null,null,null,null,null,null,null,null,null,null,null,null,null,null,null,null,null,null,null,null,null,null,null,"アルカナクラスタ",null,null,null,null,null,null,null,null,null,null,null,null,null,null,2,2,2,2,2,2,null,null,40,null,"AG限定 《ｱﾙｶﾅｽﾄﾗｲｸ》のﾀﾞﾒｰｼﾞ増加効果+10"]
[null,null,null,null,null,null,null,null,null,null,null,null,null,null,null,null,null,null,null,null,null,null,null,null,null,null,null,null,null,null,null,null,null,null,null,null,null,null,"灼炎剣 -焔-",null,null,1,null,null,null,null,null,28,null,null,null,null,null,8,8,-5,null,null,-3,null,null,"近接","0-1","炎",9,60,null,null,null,null,null,null,null,null,null,null,null,null,null,null,null,null,null,null,null,null,null,null,null,null,"ヴィジョナルフィスト",null,null,null,null,null,null,null,null,null,null,null,null,null,null,null,null,null,null,3,3,null,null,40,null,"EB限定 装備武器を素手扱いにする"]
[null,null,null,null,null,null,null,null,null,null,null,null,null,null,null,null,null,null,null,null,null,null,null,null,null,null,null,null,null,null,null,null,null,null,null,null,null,null,"アイスサーベル",null,null,null,null,1,null,null,null,30,null,3,null,2,2,-6,12,6,null,null,null,null,null,"近接","0-1","氷",10,60,null,null,null,null,null,null,null,null,null,null,null,null,null,null,null,null,null,null,null,null,null,null,null,null,"レインボーオーブ",null,null,null,null,null,null,null,null,null,null,null,null,null,null,4,null,4,4,4,4,4,4,40,null,"OK限定 OKのｸﾗｽ特典のNの値に+2"]
[null,null,null,null,null,null,null,null,null,null,null,null,null,null,null,null,null,null,null,null,null,null,null,null,null,null,null,null,null,null,null,null,null,null,null,null,null,null,"風魔槍 -鎌鼬-",null,null,null,null,1,null,null,1,34,null,null,null,null,null,null,null,null,null,12,null,null,null,"近接","0-1","風",10,60,null,null,null,null,null,null,null,null,null,null,null,null,null,null,null,null,null,null,null,null,null,null,null,null,"アクアシールド",null,null,null,null,null,null,null,null,null,null,null,null,null,null,null,-5,20,null,null,null,null,null,40,null,"WT限定 《降雨術》適用中、受けるﾀﾞﾒｰｼﾞ-10"]
[null,null,null,null,null,null,null,null,null,null,null,null,null,null,null,null,null,null,null,null,null,null,null,null,null,null,null,null,null,null,null,null,null,null,null,null,null,null,"電流警棒",null,null,null,null,null,null,null,3,31,null,null,null,-5,-5,5,null,5,null,null,5,null,null,"近接","0-1","雷",9,60,null,null,null,null,null,null,null,null,null,null,null,null,null,null,null,null,null,null,null,null,null,null,null,null,"ドーマンセーマン",null,null,null,null,null,null,null,null,null,null,null,null,2,2,2,2,2,2,2,2,10,10,40,null,"YM限定 「BS：封印」無効"]
[null,null,null,null,null,null,null,null,null,null,null,null,null,null,null,null,null,null,null,null,null,null,null,null,null,null,null,null,null,null,null,null,null,null,null,null,null,null,"隕鉄拳",null,null,-1,null,null,null,null,2,32,null,null,null,-5,-5,3,3,null,null,1,3,null,null,"近接","0-1","土",9,60,null,null,null,null,null,null,null,null,null,null,null,null,null,null,null,null,null,null,null,null,null,null,null,null,"クロックガジェット",null,null,null,null,null,null,null,null,null,null,null,null,-7,-7,-5,-5,-5,-5,-5,-5,-5,-5,40,null,"TD限定 「BS：怯み(X)」無効"]
[null,null,null,null,null,null,null,null,null,null,null,null,null,null,null,null,null,null,null,null,null,null,null,null,null,null,null,null,null,null,null,null,null,null,null,null,null,null,"アシッドウィップ",null,null,2,null,null,null,null,null,28,null,null,null,3,3,null,null,10,null,null,null,null,null,"近接","0-1","水",9,60,null,null,null,null,null,null,null,null,null,null,null,null,null,null,null,null,null,null,null,null,null,null,null,null,"パワーゲイナー",null,null,null,null,null,null,null,null,null,null,null,null,8,8,null,null,null,null,null,null,null,null,40,null,"BR限定 「種別：支」ｽｷﾙの持続ｶｳﾝﾄに+2"]
[null,null,null,null,null,null,null,null,null,null,null,null,null,null,null,null,null,null,null,null,null,null,null,null,null,null,null,null,null,null,null,null,null,null,null,null,null,null,"ミステリーハンマー",null,null,1,null,null,null,null,null,21,null,null,null,null,null,4,4,4,4,4,4,null,null,"近接","0-1","近",8,60,null,null,null,null,null,null,null,null,null,null,null,null,null,null,null,null,null,null,null,null,null,null,null,null,"カオスシール",null,null,null,null,null,null,null,null,null,null,null,null,3,3,null,null,null,null,null,null,null,null,40,null,"CR限定 戦闘開始時にｶｵｽﾊﾌﾟﾆﾝｸﾞﾛｰﾙを行える"]
[null,null,null,null,null,null,null,null,null,null,null,null,null,null,null,null,null,null,null,null,null,null,null,null,null,null,null,null,null,null,null,null,null,null,null,null,null,null,"パワーグローブ",null,null,-1,null,null,null,null,3,37,null,null,null,-6,-6,null,null,null,null,null,null,null,null,"近接","0-1","近",9,60,null,null,null,null,null,null,null,null,null,null,null,null,null,null,null,null,null,null,null,null,null,null,null,null,"パニックマーク",null,null,null,null,null,null,null,null,null,null,null,null,null,null,6,6,null,null,null,null,null,null,40,null,"MV限定 MVのｸﾗｽ特典のﾀﾞﾒｰｼﾞに+7"]
[null,null,null,null,null,null,null,null,null,null,null,null,null,null,null,null,null,null,null,null,null,null,null,null,null,null,null,null,null,null,null,null,null,null,null,null,null,null,"ライダーランス",null,null,1,null,null,null,null,-2,38,null,null,null,4,4,null,null,null,null,null,null,null,null,"近接","0-1","近",10,60,null,null,null,null,null,null,null,null,null,null,null,null,null,null,null,null,null,null,null,null,null,null,null,null,"パラフェルナリア",null,null,null,null,null,null,null,null,null,null,null,null,2,2,2,2,2,2,2,2,2,2,40,null,"TA限定 戦闘開始時にｱｲﾃﾑ生成ﾛｰﾙを振ってもよい"]
[null,null,null,null,null,null,null,null,null,null,null,null,null,null,null,null,null,null,null,null,null,null,null,null,null,null,null,null,null,null,null,null,null,null,null,null,null,null,"バンブースピア",null,null,1,null,1,null,null,2,28,null,null,null,null,null,-17,null,null,null,3,3,3,null,"近接","0-1","土",9,60,null,null,null,null,null,null,null,null,null,null,null,null,null,null,null,null,null,null,null,null,null,null,null,null,"レーザーサイト",null,null,null,1,null,null,null,null,4,4,null,null,3,3,null,null,null,null,null,null,3,8,40,null,"LS限定"]
[null,null,null,null,null,null,null,null,null,null,null,null,null,null,null,null,null,null,null,null,null,null,null,null,null,null,null,null,null,null,null,null,null,null,null,null,null,null,"ヴァリアブルスピア",null,null,1,null,null,null,null,null,18,null,6,8,3,3,null,null,null,null,null,null,null,null,"近接","0-1","近",10,60,null,null,null,null,null,null,null,null,null,null,null,null,null,null,null,null,null,null,null,null,null,null,null,null,"ニンジャブーツ",null,null,null,null,2,null,null,null,null,null,null,null,-2,-2,null,null,null,null,null,null,null,null,40,null,"SN限定"]
[null,null,null,null,null,null,null,null,null,null,null,null,null,null,null,null,null,null,null,null,null,null,null,null,null,null,null,null,null,null,null,null,null,null,null,null,null,null,"マジカルヌンチャク",null,null,-1,null,1,null,null,1,33,null,null,null,5,null,null,null,null,null,null,null,null,null,"近接","0-1","近",9,60,null,null,null,null,null,null,null,null,null,null,null,null,null,null,null,null,null,null,null,null,null,null,null,null,"パートナードール",null,null,null,null,null,null,null,null,null,null,null,null,4,4,null,null,null,null,null,null,null,null,40,null,"CP限定 戦闘開始時に自身のﾏｽにﾄﾞｰﾙを配置"]
[null,null,null,null,null,null,null,null,null,null,null,null,null,null,null,null,null,null,null,null,null,null,null,null,null,null,null,null,null,null,null,null,null,null,null,null,null,null,"カラフルブレード",null,null,null,null,null,null,1,2,27,null,12,null,null,null,3,3,3,3,3,3,3,3,"近接","0-1","※",9,60,null,null,null,null,null,null,null,null,null,null,null,null,null,null,null,null,null,null,null,null,null,null,null,null,"イマジナリィボウ",null,null,null,null,null,null,null,null,null,null,null,null,null,null,2,2,2,2,2,2,null,10,40,null,"SA限定 装備武器の名称を「Iボウ」にする"]
[null,null,null,null,null,null,null,null,null,null,null,null,null,null,null,null,null,null,null,null,null,null,null,null,null,null,null,null,null,null,null,null,null,null,null,null,null,null,"ヒュージシールド",null,null,null,null,1,null,null,-5,27,null,15,null,13,12,11,10,6,12,14,7,8,6,"近接","0-1","近",12,60,null,null,null,null,null,null,null,null,null,null,null,null,null,null,null,null,null,null,null,null,null,null,null,null,"禁断の栞",null,null,null,null,null,null,null,null,null,null,null,null,6,6,6,6,6,6,6,6,6,6,40,null,"FM限定"]
[null,null,null,null,null,null,null,null,null,null,null,null,null,null,null,null,null,null,null,null,null,null,null,null,null,null,null,null,null,null,null,null,null,null,null,null,null,null,"カースライフル",null,null,null,1,null,null,null,-1,18,null,null,null,null,null,null,null,null,null,null,null,null,3,"射撃","0-4","遠","(1)→9",60,null,null,null,null,null,null,null,null,null,null,null,null,null,null,null,null,null,null,null,null,null,null,null,null,"マジックバリアー",null,null,null,null,null,null,null,null,null,null,null,null,5,5,3,3,3,3,3,3,3,3,40,null,"BD限定 戦闘開始時にﾊﾞﾘｱ状態を付与してもよい"]
[null,null,null,null,null,null,null,null,null,null,null,null,null,null,null,null,null,null,null,null,null,null,null,null,null,null,null,null,null,null,null,null,null,null,null,null,null,null,"ブラックバズーカ",null,null,null,null,null,null,null,null,22,null,null,2,3,3,null,null,null,null,null,null,10,10,"射撃","0-3","闇",10,60,null,null,null,null,null,null,null,null,null,null,null,null,null,null,null,null,null,null,null,null,null,null,null,null,"アイドロンセーバー",null,null,null,null,null,null,null,null,null,null,null,null,null,null,null,null,null,null,null,null,null,null,40,null,"ER限定 1戦闘1回 「幻獣」が受けるﾀﾞﾒｰｼﾞを0にする"]
[null,null,null,null,null,null,null,null,null,null,null,null,null,null,null,null,null,null,null,null,null,null,null,null,null,null,null,null,null,null,null,null,null,null,null,null,null,null,"デリンジャー",null,null,null,1,null,null,null,1,16,null,null,null,-3,-3,null,null,null,null,null,null,null,null,"射撃","0-3","遠",9,60,null,null,null,null,null,null,null,null,null,null,null,null,null,null,null,null,null,null,null,null,null,null,null,null,"エターナルリーフ",null,null,null,null,null,null,null,null,null,null,null,null,-3,-3,-10,-5,5,null,5,5,12,-7,40,null,"PP限定 ﾀﾞﾒｰｼﾞを受ける度に3MP回復"]
[null,null,null,null,null,null,null,null,null,null,null,null,null,null,null,null,null,null,null,null,null,null,null,null,null,null,null,null,null,null,null,null,null,null,null,null,null,null,"コントロールロッド",null,null,null,1,null,null,null,-1,23,null,null,null,3,3,9,-5,-5,null,null,null,2,4,"射撃","0-3","炎","(2)→7",60,null,null,null,null,null,null,null,null,null,null,null,null,null,null,null,null,null,null,null,null,null,null,null,null,"ミニチュア天球儀",null,null,null,null,null,null,null,null,null,null,null,null,4,4,8,null,null,8,null,null,null,8,40,null,"AW限定 1戦闘1回 自身判定直後達成値+3"]
[null,null,null,null,null,null,null,null,null,null,null,null,null,null,null,null,null,null,null,null,null,null,null,null,null,null,null,null,null,null,null,null,null,null,null,null,null,null,"ライトスナイパー",null,null,null,1,null,null,null,-3,27,null,null,null,3,3,null,null,null,null,null,null,14,null,"射撃","0-4","光","(3)→7",60,null,null,null,null,null,null,null,null,null,null,null,null,null,null,null,null,null,null,null,null,null,null,null,null,"てるてる魔坊主",null,null,null,null,null,null,null,null,null,null,null,null,5,5,6,null,6,null,6,null,6,null,40,null,"WP限定 《天候の支配者》のSL上限+2"]
[null,null,null,null,null,null,null,null,null,null,null,null,null,null,null,null,null,null,null,null,null,null,null,null,null,null,null,null,null,null,null,null,null,null,null,null,null,null,"スーパーメガホン",null,null,null,1,null,null,1,null,21,null,null,null,3,3,null,null,null,null,null,null,null,null,"射撃","0-4","遠",10,60,null,null,null,null,null,null,null,null,null,null,null,null,null,null,null,null,null,null,null,null,null,null,null,null,"アーツイヤリング",null,null,null,null,null,null,null,null,null,null,null,null,null,null,null,null,null,null,null,null,null,null,40,null,"IA限定 「種別：支」ｽｷﾙの代償-2MP (下限値：5MP)"]
[null,null,null,null,null,null,null,null,null,null,null,null,null,null,null,null,null,null,null,null,null,null,null,null,null,null,null,null,null,null,null,null,null,null,null,null,null,null,"ホールドワイヤー",null,null,null,null,null,null,null,null,25,null,null,null,3,3,null,null,null,null,null,null,null,null,"射撃","0-4","遠",9,60,null,null,null,null,null,null,null,null,null,null,null,null,null,null,null,null,null,null,null,null,null,null,null,null,"命の結晶",null,null,null,null,null,null,null,null,null,null,null,null,3,3,4,4,4,4,4,4,6,6,40,null,"VM限定 「種別：回」のHP回復量+5"]
[null,null,null,null,null,null,null,null,null,null,null,null,null,null,null,null,null,null,null,null,null,null,null,null,null,null,null,null,null,null,null,null,null,null,null,null,null,null,"レーザーガン改",null,null,null,1,null,null,null,null,21,null,null,null,null,null,null,null,null,null,null,null,5,5,"射撃","2-3","光",8,60,null,null,null,null,null,null,null,null,null,null,null,null,null,null,null,null,null,null,null,null,null,null,null,null,"ドラゴンバングル",null,null,null,null,null,null,null,1,null,null,16,null,3,3,7,7,7,7,7,7,null,null,40,null,"SF専用"]
[null,null,null,null,null,null,null,null,null,null,null,null,null,null,null,null,null,null,null,null,null,null,null,null,null,null,null,null,null,null,null,null,null,null,null,null,null,null,"カースクロスボウ",null,null,null,1,null,null,null,-2,23,null,null,null,-4,null,null,null,null,null,null,null,5,5,"射撃","2-4","闇","(3)→6",60,null,null,null,null,null,null,null,null,null,null,null,null,null,null,null,null,null,null,null,null,null,null,null,null,"ドリームレンズ",null,null,null,null,null,null,null,null,null,null,null,null,null,null,1,1,1,1,1,1,null,null,40,null,"DP専用 ｸﾗｽ特典を1戦闘2回使用できる"]
[null,null,null,null,null,null,null,null,null,null,null,null,null,null,null,null,null,null,null,null,null,null,null,null,null,null,null,null,null,null,null,null,null,null,null,null,null,null,"バリアキャノン",null,null,null,null,null,null,null,null,15,null,null,null,7,7,3,3,3,3,3,3,4,4,"射撃","0-3","近","(3)→6",60,null,null,null,null,null,null,null,null,null,null,null,null,null,null,null,null,null,null,null,null,null,null,null,null,"サイコチューナー",null,null,null,null,null,null,null,null,null,null,null,null,null,null,null,null,null,null,null,null,null,null,40]
[null,null,null,null,null,null,null,null,null,null,null,null,null,null,null,null,null,null,null,null,null,null,null,null,null,null,null,null,null,null,null,null,null,null,null,null,null,null,"アンブレラガン",null,null,null,1,null,null,1,null,18,null,3,null,3,3,1,1,1,1,1,1,null,null,"射撃","0-3","遠",11,60,null,null,null,null,null,null,null,null,null,null,null,null,null,null,null,null,null,null,null,null,null,null,null,null,"カラーブレスレット",null,null,null,null,null,null,null,null,null,null,null,null,null,null,null,null,null,null,null,null,null,null,40]
[null,null,null,null,null,null,null,null,null,null,null,null,null,null,null,null,null,null,null,null,null,null,null,null,null,null,null,null,null,null,null,null,null,null,null,null,null,null,"テレスコープガン",null,null,null,1,null,null,null,null,25,null,8,6,3,3,null,null,null,null,null,null,null,null,"射撃","0-3","遠",10,60,null,null,null,null,null,null,null,null,null,null,null,null,null,null,null,null,null,null,null,null,null,null,null,null,"薬莢ネックレス",null,null,null,null,null,null,null,-3,10,10,null,null,2,2,null,null,null,null,null,null,null,null,40]
[null,null,null,null,null,null,null,null,null,null,null,null,null,null,null,null,null,null,null,null,null,null,null,null,null,null,null,null,null,null,null,null,null,null,null,null,null,null,"ヘヴィガトリング",null,null,null,null,null,null,null,-5,41,null,null,null,11,9,null,null,null,null,null,null,null,null,"射撃","0-4","遠",12,60,null,null,null,null,null,null,null,null,null,null,null,null,null,null,null,null,null,null,null,null,null,null,null,null,"チャージプロテクタ",null,null,null,null,null,null,null,null,null,null,null,null,8,8,7,7,7,7,7,7,7,7,40]
[null,null,null,null,null,null,null,null,null,null,null,null,null,null,null,null,null,null,null,null,null,null,null,null,null,null,null,null,null,null,null,null,null,null,null,null,null,null,"ラッキーロングボウ",null,null,null,null,null,null,null,2,25,null,null,null,3,3,null,null,null,null,null,null,null,null,"射撃","0-4","遠",11,60,null,null,null,null,null,null,null,null,null,null,null,null,null,null,null,null,null,null,null,null,null,null,null,null,"ラッキークリスタル",null,null,null,null,null,null,null,null,null,null,null,null,5,5,2,2,2,2,2,2,null,null,40]
[null,null,null,null,null,null,null,null,null,null,null,null,null,null,null,null,null,null,null,null,null,null,null,null,null,null,null,null,null,null,null,null,null,null,null,null,null,null,"アルカナ-22",null,null,null,null,null,null,null,null,null,17,null,2,null,null,2,2,2,2,2,2,1,1,"魔法","0-2","遠","(3)→7",60,null,null,null,null,null,null,null,null,null,null,null,null,null,null,null,null,null,null,null,null,null,null,null,null,"プラチナピアス",null,null,null,null,null,null,null,null,null,null,null,10,10,10,5,5,3,null,5,5,4,4,40]
[null,null,null,null,null,null,null,null,null,null,null,null,null,null,null,null,null,null,null,null,null,null,null,null,null,null,null,null,null,null,null,null,null,null,null,null,null,null,"人工エリクシル",null,null,null,null,null,1,1,null,null,17,null,null,null,null,6,null,6,null,6,6,null,null,"魔法","0-3","※","(4)→6",60]
[null,null,null,null,null,null,null,null,null,null,null,null,null,null,null,null,null,null,null,null,null,null,null,null,null,null,null,null,null,null,null,null,null,null,null,null,null,null,"アルカナセッター",null,null,null,null,null,1,null,1,null,15,null,null,3,3,null,null,null,null,null,null,null,null,"魔法","1-3","遠","(5)→6",60]
[null,null,null,null,null,null,null,null,null,null,null,null,null,null,null,null,null,null,null,null,null,null,null,null,null,null,null,null,null,null,null,null,null,null,null,null,null,null,"セブンスワンド",null,null,null,null,null,null,null,null,null,16,null,null,null,null,2,null,2,2,2,2,2,2,"魔法","0-4","光","(2)→8",60]
[null,null,null,null,null,null,null,null,null,null,null,null,null,null,null,null,null,null,null,null,null,null,null,null,null,null,null,null,null,null,null,null,null,null,null,null,null,null,"陰陽符",null,null,null,null,null,null,null,null,null,19,null,null,1,1,null,null,null,null,null,null,4,4,"魔法","1-4","※","(3)→8",60]
[null,null,null,null,null,null,null,null,null,null,null,null,null,null,null,null,null,null,null,null,null,null,null,null,null,null,null,null,null,null,null,null,null,null,null,null,null,null,"マジカルウォッチ",null,null,null,null,null,null,1,null,null,23,null,null,null,null,null,null,null,null,null,null,null,3,"魔法","0-1","闇",11,60]
[null,null,null,null,null,null,null,null,null,null,null,null,null,null,null,null,null,null,null,null,null,null,null,null,null,null,null,null,null,null,null,null,null,null,null,null,null,null,"クレイジーアイ",null,null,null,null,null,null,null,null,null,17,null,5,7,7,null,null,null,null,null,null,null,null,"魔法","0-4","遠","(3)→8",60]
[null,null,null,null,null,null,null,null,null,null,null,null,null,null,null,null,null,null,null,null,null,null,null,null,null,null,null,null,null,null,null,null,null,null,null,null,null,null,"忍術大全",null,null,null,null,null,2,null,null,null,10,null,null,null,null,2,2,2,2,2,2,null,null,"魔法","0-4","遠","(3)→8",60]
[null,null,null,null,null,null,null,null,null,null,null,null,null,null,null,null,null,null,null,null,null,null,null,null,null,null,null,null,null,null,null,null,null,null,null,null,null,null,"人形強化の書",null,null,1,null,null,1,null,null,null,11,null,null,3,3,null,null,null,null,null,null,3,3,"魔法","0-3","遠","(5)→5",60]
[null,null,null,null,null,null,null,null,null,null,null,null,null,null,null,null,null,null,null,null,null,null,null,null,null,null,null,null,null,null,null,null,null,null,null,null,null,null,"禁じられた書物",null,null,null,null,null,null,null,null,null,25,-15,5,null,null,2,2,2,2,2,2,2,2,"魔法","0-3","遠","(4)→6",60]
[null,null,null,null,null,null,null,null,null,null,null,null,null,null,null,null,null,null,null,null,null,null,null,null,null,null,null,null,null,null,null,null,null,null,null,null,null,null,"スターダストロッド",null,null,null,null,null,1,null,2,null,15,null,4,null,null,3,3,3,3,3,3,3,3,"魔法","0-3","光","(4)→7",60]
[null,null,null,null,null,null,null,null,null,null,null,null,null,null,null,null,null,null,null,null,null,null,null,null,null,null,null,null,null,null,null,null,null,null,null,null,null,null,"クリアウィングリスト",null,null,null,null,null,1,null,null,null,21,null,4,2,4,3,1,3,1,3,1,null,null,"魔法","0-3","近","(4)→8",60]
[null,null,null,null,null,null,null,null,null,null,null,null,null,null,null,null,null,null,null,null,null,null,null,null,null,null,null,null,null,null,null,null,null,null,null,null,null,null,"ゼログローブ",null,null,null,null,null,1,null,null,null,16,null,10,4,4,null,null,null,null,null,null,null,null,"魔法","0-3","遠","(2)→9",60]
[null,null,null,null,null,null,null,null,null,null,null,null,null,null,null,null,null,null,null,null,null,null,null,null,null,null,null,null,null,null,null,null,null,null,null,null,null,null,"メタリックロッド",null,null,null,null,null,null,1,null,null,15,null,3,4,4,8,8,8,null,8,8,6,6,"魔法","0-3","近","(3)→8",60]
[null,null,null,null,null,null,null,null,null,null,null,null,null,null,null,null,null,null,null,null,null,null,null,null,null,null,null,null,null,null,null,null,null,null,null,null,null,null,"--------スキル--------"]
[null,null,null,null,null,null,null,null,null,null,null,null,null,null,null,null,null,null,null,null,null,null,null,null,null,null,null,null,null,null,null,null,null,null,null,null,null,null,"イービルスレイヤー",null,null,1,null,null,null,null,null,{"$f":"(SL+CL)*5+15","v":20},null,null,null,null,null,null,null,null,null,null,null,null,{"$f":"20+CL*2","v":22},"近接","0-1","光",8,0]
[null,null,null,null,null,null,null,null,null,null,null,null,null,null,null,null,null,null,null,null,null,null,null,null,null,null,null,null,null,null,null,null,null,null,null,null,null,null,"死神の鎌",null,null,null,null,null,null,null,null,{"$f":"CL*8+30","v":38},null,null,null,{"$f":"CL*8","v":8},{"$f":"CL*8","v":8},null,null,null,null,null,null,null,null,"近接","0-1","闇",8,0]
[null,null,null,null,null,null,null,null,null,null,null,null,null,null,null,null,null,null,null,null,null,null,null,null,null,null,null,null,null,null,null,null,null,null,null,null,null,null,"LAEVATEINN",null,null,null,null,null,null,2,null,{"$f":"15+SL*6","v":15},null,null,null,null,null,{"$f":"SL*2+CL","v":1},null,null,{"$f":"SL*2+CL","v":1},null,null,{"$f":"SL*2+CL","v":1},null,"近接","0-1","炎",11,0]
[null,null,null,null,null,null,null,null,null,null,null,null,null,null,null,null,null,null,null,null,null,null,null,null,null,null,null,null,null,null,null,null,null,null,null,null,null,null,"アイストライデント",null,null,1,null,1,null,2,null,{"$f":"(SL+CL)*4","v":4},null,null,null,null,null,null,null,null,null,null,null,null,null,"近接","0-3","氷",8,0]
[null,null,null,null,null,null,null,null,null,null,null,null,null,null,null,null,null,null,null,null,null,null,null,null,null,null,null,null,null,null,null,null,null,null,null,null,null,null,"付喪武器",null,null,1,null,1,null,null,null,{"$f":"(SL+CL)*4","v":4},null,null,null,null,null,null,null,null,null,null,null,null,null,"近接","0-1","近",10,0]
[null,null,null,null,null,null,null,null,null,null,null,null,null,null,null,null,null,null,null,null,null,null,null,null,null,null,null,null,null,null,null,null,null,null,null,null,null,null,"追憶の名剣",null,null,2,null,null,null,null,null,{"$f":"(SL+CL)*4","v":4},null,null,null,null,null,null,null,null,null,null,null,null,null,"近接","0-1","近",11,0]
[null,null,null,null,null,null,null,null,null,null,null,null,null,null,null,null,null,null,null,null,null,null,null,null,null,null,null,null,null,null,null,null,null,null,null,null,null,null,"ツララランス",null,null,null,null,2,null,null,null,{"$f":"SL*3+15","v":15},null,null,null,null,null,null,20,null,null,null,null,null,null,"近接","0-2","氷",8,0]
[null,null,null,null,null,null,null,null,null,null,null,null,null,null,null,null,null,null,null,null,null,null,null,null,null,null,null,null,null,null,null,null,null,null,null,null,null,null,"ブラッドブレード",null,null,null,null,null,null,null,null,{"$f":"(SL+CL)*5","v":5},null,null,null,null,null,null,null,null,null,null,null,null,null,"近接","0-1","近",8,0]
[null,null,null,null,null,null,null,null,null,null,null,null,null,null,null,null,null,null,null,null,null,null,null,null,null,null,null,null,null,null,null,null,null,null,null,null,null,null,"ヌルウェポン",null,null,null,null,null,null,null,null,{"$f":"(SL*4)+10","v":10},null,null,null,null,null,null,null,null,null,null,null,{"$f":"SL+CL","v":1},{"$f":"SL+CL","v":1},"近接","0-1","無",10,0]
[null,null,null,null,null,null,null,null,null,null,null,null,null,null,null,null,null,null,null,null,null,null,null,null,null,null,null,null,null,null,null,null,null,null,null,null,null,null,"Qソード",null,null,1,null,null,null,null,null,{"$f":"(SL+CL)*4","v":4},null,null,null,null,null,{"$f":"SL*2","v":0},null,{"$f":"SL*2","v":0},null,{"$f":"SL*2","v":0},{"$f":"SL*2","v":0},null,null,"近接","0-1","炎水風土",8,0]
[null,null,null,null,null,null,null,null,null,null,null,null,null,null,null,null,null,null,null,null,null,null,null,null,null,null,null,null,null,null,null,null,null,null,null,null,null,null,"ムーンブレード",null,null,null,null,null,null,null,null,{"$f":"SL*4+18","v":18},null,null,null,null,null,null,null,null,null,null,null,{"$f":"CL*2","v":2},{"$f":"CL*2","v":2},"近接","0-1","闇",8,0]
[null,null,null,null,null,null,null,null,null,null,null,null,null,null,null,null,null,null,null,null,null,null,null,null,null,null,null,null,null,null,null,null,null,null,null,null,null,null,"ライトセーバー",null,null,2,null,null,null,2,null,{"$f":"SL*4+24","v":24},null,null,null,null,null,null,null,null,null,null,null,null,null,"近接","0-1","光",9,0]
[null,null,null,null,null,null,null,null,null,null,null,null,null,null,null,null,null,null,null,null,null,null,null,null,null,null,null,null,null,null,null,null,null,null,null,null,null,null,"彗星の剣",null,null,null,null,null,null,null,null,{"$f":"(SL+CL)*4","v":4},null,null,null,null,null,null,null,null,null,null,null,{"$f":"SL*3","v":0},{"$f":"SL*3","v":0},"近接","0-1","光",10,0]
[null,null,null,null,null,null,null,null,null,null,null,null,null,null,null,null,null,null,null,null,null,null,null,null,null,null,null,null,null,null,null,null,null,null,null,null,null,null,"Sシールド",null,null,null,null,null,null,1,-10,{"$f":"SL*4+20","v":20},null,null,null,{"$f":"SL*3","v":0},{"$f":"SL*3","v":0},null,null,null,null,null,null,null,null,"近接","0-1","近",13,0]
[null,null,null,null,null,null,null,null,null,null,null,null,null,null,null,null,null,null,null,null,null,null,null,null,null,null,null,null,null,null,null,null,null,null,null,null,null,null,"魔法双剣",null,null,null,null,null,null,null,null,{"$f":"SL*5+13","v":13},null,null,null,null,null,null,null,null,null,null,null,null,null,"近接","0-1","近",13,0]
[null,null,null,null,null,null,null,null,null,null,null,null,null,null,null,null,null,null,null,null,null,null,null,null,null,null,null,null,null,null,null,null,null,null,null,null,null,null,"雷水晶の剣",null,null,null,null,2,null,null,null,{"$f":"SL*5+18","v":18},null,null,null,null,null,null,null,null,{"$f":"CL*8","v":8},null,null,null,null,"近接","0-2","雷",8,0]
[null,null,null,null,null,null,null,null,null,null,null,null,null,null,null,null,null,null,null,null,null,null,null,null,null,null,null,null,null,null,null,null,null,null,null,null,null,null,"宵闇の氷槍",null,null,2,null,null,null,null,null,{"$f":"(SL+CL)*5","v":5},null,null,null,null,null,null,{"$f":"CL*5","v":5},{"$f":"CL*5","v":5},null,null,null,{"$f":"CL*5","v":5},{"$f":"CL*5","v":5},"近接","0-2","氷闇",9,0]
[null,null,null,null,null,null,null,null,null,null,null,null,null,null,null,null,null,null,null,null,null,null,null,null,null,null,null,null,null,null,null,null,null,null,null,null,null,null,"ABYSS",null,null,3,null,null,null,null,null,{"$f":"SL*9","v":0},null,null,null,null,null,null,null,null,null,null,null,null,null,"近接","0-1","近",10,0]
[null,null,null,null,null,null,null,null,null,null,null,null,null,null,null,null,null,null,null,null,null,null,null,null,null,null,null,null,null,null,null,null,null,null,null,null,null,null,"破天手甲",null,null,null,null,null,null,null,null,{"$f":"(SL+CL+2)*5","v":15},null,null,null,{"$f":"SL*5","v":0},null,{"$f":"CL","v":1},{"$f":"CL","v":1},null,null,null,null,null,null,"近接","0-1","近",9,0]
[null,null,null,null,null,null,null,null,null,null,null,null,null,null,null,null,null,null,null,null,null,null,null,null,null,null,null,null,null,null,null,null,null,null,null,null,null,null,"エアブレイカー",null,null,null,1,null,null,null,null,{"$f":"SL*5+15","v":15},null,null,null,null,null,null,null,null,null,null,null,null,null,"射撃","0-3","遠",10,0]
[null,null,null,null,null,null,null,null,null,null,null,null,null,null,null,null,null,null,null,null,null,null,null,null,null,null,null,null,null,null,null,null,null,null,null,null,null,null,"ノイズガン",null,null,null,2,null,null,null,null,{"$f":"(SL+CL)*4","v":4},null,null,null,null,null,null,null,null,null,null,null,null,null,"射撃","0-4","風",9,0]
[null,null,null,null,null,null,null,null,null,null,null,null,null,null,null,null,null,null,null,null,null,null,null,null,null,null,null,null,null,null,null,null,null,null,null,null,null,null,"BLR",null,null,null,null,-2,null,2,null,{"$f":"SL*3+CS!$AI$39","v":17},null,null,null,null,null,null,null,null,null,null,null,null,null,"射撃","0-5","光",8,0]
[null,null,null,null,null,null,null,null,null,null,null,null,null,null,null,null,null,null,null,null,null,null,null,null,null,null,null,null,null,null,null,null,null,null,null,null,null,null,"ブラッディアS",null,null,null,2,null,null,null,null,{"$f":"SL*4+CL*3","v":3},null,null,null,null,null,null,null,null,null,null,null,null,null,"射撃","0-5","遠",11,0]
[null,null,null,null,null,null,null,null,null,null,null,null,null,null,null,null,null,null,null,null,null,null,null,null,null,null,null,null,null,null,null,null,null,null,null,null,null,null,"特大手裏剣",null,null,null,1,null,null,null,null,{"$f":"SL*5+CL*5","v":5},null,null,null,null,null,null,null,null,null,null,null,null,null,"射撃","0-3","遠",10,0]
[null,null,null,null,null,null,null,null,null,null,null,null,null,null,null,null,null,null,null,null,null,null,null,null,null,null,null,null,null,null,null,null,null,null,null,null,null,null,"ルーンデスサイズ",null,null,null,null,null,null,null,null,null,{"$f":"CL*3","v":3},null,null,null,null,null,null,null,null,null,null,{"$f":"CL*SL","v":0},null,"魔法","2-4","闇","(3)→6",0]

{"sheet":"武器用","index":6,"n_rows":188,"n_cols":32,"rows_kept":188,"cut":false,"hidden":false,"merged":[[111,1,111,3],[112,1,112,3],[113,1,113,3],[114,1,114,3],[115,1,115,3],[116,1,116,3],[117,1,117,3],[118,1,118,3],[67,1,67,3],[68,1,68,3],[69,1,69,3],[70,1,70,3],[71,1,71,3],[72,1,72,3],[73,1,73,3],[74,1,74,3],[75,1,75,3],[76,1,76,3],[77,1,77,3],[78,1,78,3],[79,1,79,3],[103,1,103,3],[104,1,104,3],[105,1,105,3],[212,1,212,3],[190,1,190,3],[191,1,191,3],[192,1,192,3],[193,1,193,3],[194,1,194,3],[195,1,195,3],[196,1,196,3],[198,1,198,3],[199,1,199,3],[206,1,206,3],[207,1,207,3],[208,1,208,3],[209,1,209,3],[210,1,210,3],[211,1,211,3],[200,1,200,3],[201,1,201,3],[202,1,202,3],[203,1,203,3],[204,1,204,3],[205,1,205,3],[185,1,185,3],[179,1,179,3],[180,1,180,3],[163,1,163,3],[164,1,164,3],[197,1,197,3],[165,1,165,3],[168,1,168,3],[169,1,169,3],[187,1,187,3],[188,1,188,3],[189,1,189,3],[174,1,174,3],[175,1,175,3],[176,1,176,3],[182,1,182,3],[186,1,186,3],[153,1,153,3],[154,1,154,3],[155,1,155,3],[156,1,156,3],[157,1,157,3],[162,1,162,3],[184,1,184,3],[166,1,166,3],[178,1,178,3],[170,1,170,3],[171,1,171,3],[172,1,172,3],[177,1,177,3],[183,1,183,3],[173,1,173,3],[167,1,167,3],[158,1,158,3],[159,1,159,3],[181,1,181,3],[160,1,160,3],[161,1,161,3],[143,1,143,3],[148,1,148,3],[149,1,149,3],[150,1,150,3],[151,1,151,3],[152,1,152,3],[137,1,137,3],[138,1,138,3],[139,1,139,3],[140,1,140,3],[141,1,141,3],[142,1,142,3],[144,1,144,3],[145,1,145,3],[146,1,146,3],[147,1,147,3],[127,1,127,3],[128,1,128,3],[129,1,129,3],[134,1,134,3],[135,1,135,3],[136,1,136,3],[121,1,121,3],[122,1,122,3],[123,1,123,3],[124,1,124,3],[125,1,125,3],[126,1,126,3],[130,1,130,3],[131,1,131,3],[132,1,132,3],[133,1,133,3],[119,1,119,3],[120,1,120,3],[106,1,106,3],[107,1,107,3],[108,1,108,3],[109,1,109,3],[110,1,110,3],[51,1,51,3],[52,1,52,3],[53,1,53,3],[80,1,80,3],[81,1,81,3],[82,1,82,3],[57,1,57,3],[58,1,58,3],[59,1,59,3],[60,1,60,3],[61,1,61,3],[62,1,62,3],[63,1,63,3],[64,1,64,3],[65,1,65,3],[101,1,101,3],[102,1,102,3],[45,1,45,3],[46,1,46,3],[47,1,47,3],[48,1,48,3],[49,1,49,3],[50,1,50,3],[54,1,54,3],[55,1,55,3],[56,1,56,3],[42,1,42,3],[43,1,43,3],[44,1,44,3],[7,1,7,3],[8,1,8,3],[9,1,9,3],[10,1,10,3],[11,1,11,3],[12,1,12,3],[15,1,15,3],[16,1,16,3],[17,1,17,3],[18,1,18,3],[19,1,19,3],[20,1,20,3],[21,1,21,3],[22,1,22,3],[23,1,23,3],[24,1,24,3],[25,1,25,3],[26,1,26,3],[27,1,27,3],[28,1,28,3],[29,1,29,3],[1,1,1,3],[2,1,2,3],[3,1,3,3],[4,1,4,3],[5,1,5,3],[6,1,6,3],[13,1,13,3],[14,1,14,3],[41,1,41,3],[30,1,30,3],[31,1,31,3],[32,1,32,3],[33,1,33,3],[34,1,34,3],[35,1,35,3],[36,1,36,3],[37,1,37,3],[38,1,38,3],[39,1,39,3],[40,1,40,3],[66,1,66,3],[93,1,93,3],[94,1,94,3],[95,1,95,3],[96,1,96,3],[97,1,97,3],[98,1,98,3],[99,1,99,3],[100,1,100,3],[89,1,89,3],[90,1,90,3],[91,1,91,3],[92,1,92,3],[83,1,83,3],[84,1,84,3],[85,1,85,3],[86,1,86,3],[87,1,87,3],[88,1,88,3]]}
[]
[null,"武器名",null,null,"近接","射撃","回避","魔術","抵抗","敏捷","物攻","魔攻","耐久","精神","近","遠","炎","氷","水","雷","風","土","光","闇","種別","射程","属性","ｺｽﾄ","効果","金額",null,"装備リスト"]
[null,"--------近接1--------",null,null,null,null,null,null,null,null,null,null,null,null,null,null,null,null,null,null,null,null,null,null,null,null,null,null,null,0,null,"---- 一般武器 ----"]
[null,"素手",null,null,-2,null,null,null,null,1,16,null,null,null,-7,-7,null,null,null,null,null,null,null,null,"近接","0-1","近",9,"効果なし",0,null,{"$f":"IF(CS!$AJ$16=\"近接\",B4,IF(CS!$AJ$16=\"射撃\",B43,IF(CS!$AJ$16=\"魔術\",B82, )))","v":"素手"}]
[null,"スタンダードソード",null,null,null,null,null,null,null,null,20,null,null,null,3,1,null,null,null,null,null,null,null,null,"近接","0-1","近",9,"効果なし",10,null,{"$f":"IF(CS!$AJ$16=\"近接\",B5,IF(CS!$AJ$16=\"射撃\",B44,IF(CS!$AJ$16=\"魔術\",B83, )))","v":"スタンダードソード"}]
[null,"レイピア",null,null,-1,null,null,null,null,1,28,null,null,null,2,null,null,null,null,null,null,null,null,null,"近接","0-1","近",9,"効果なし",10,null,{"$f":"IF(CS!$AJ$16=\"近接\",B6,IF(CS!$AJ$16=\"射撃\",B45,IF(CS!$AJ$16=\"魔術\",B84, )))","v":"レイピア"}]
[null,"バスタードソード",null,null,-2,null,-1,null,null,-1,36,null,3,null,3,2,1,1,1,null,null,null,null,null,"近接","0-1","近",10,"効果なし",10,null,{"$f":"IF(CS!$AJ$16=\"近接\",B7,IF(CS!$AJ$16=\"射撃\",B46,IF(CS!$AJ$16=\"魔術\",B85, )))","v":"バスタードソード"}]
[null,"鋼鉄剣 -玉鋼-",null,null,null,null,null,null,null,null,22,null,null,null,4,1,null,null,2,null,1,2,null,null,"近接","0-1","近",9,"スキルによらない武器攻撃ダメージに+10",20,null,{"$f":"IF(CS!$AJ$16=\"近接\",B8,IF(CS!$AJ$16=\"射撃\",B47,IF(CS!$AJ$16=\"魔術\",B86, )))","v":"鋼鉄剣 -玉鋼-"}]
[null,"ブレードシールド",null,null,-1,null,-1,null,-1,null,23,null,3,null,4,4,2,2,1,1,null,3,null,null,"近接","0-1","近",10,"効果なし",25,null,{"$f":"IF(CS!$AJ$16=\"近接\",B9,IF(CS!$AJ$16=\"射撃\",B48,IF(CS!$AJ$16=\"魔術\",B87, )))","v":"ブレードシールド"}]
[null,"マジックシールド",null,null,null,null,null,null,1,null,12,3,3,null,7,7,4,4,4,4,4,4,4,4,"近接","0-1","近",10,"効果なし",35,null,{"$f":"IF(CS!$AJ$16=\"近接\",B10,IF(CS!$AJ$16=\"射撃\",B49,IF(CS!$AJ$16=\"魔術\",B88, )))","v":"マジックシールド"}]
[null,"高周波ブレード",null,null,null,null,null,null,-1,null,26,null,null,null,4,3,4,null,null,null,3,null,null,null,"近接","0-1","風",9,"この武器で攻撃を行う度、【MP】2点消費",40,null,{"$f":"IF(CS!$AJ$16=\"近接\",B11,IF(CS!$AJ$16=\"射撃\",B50,IF(CS!$AJ$16=\"魔術\",B89, )))","v":"高周波ブレード"}]
[null,"パワードナックル",null,null,-1,null,null,null,null,1,30,null,null,null,-3,-3,null,null,null,null,null,null,null,null,"近接","0-1","近",9,"素手扱い武器",45,null,{"$f":"IF(CS!$AJ$16=\"近接\",B12,IF(CS!$AJ$16=\"射撃\",B51,IF(CS!$AJ$16=\"魔術\",B90, )))","v":"パワードナックル"}]
[null,"紫電",null,null,null,null,null,null,null,null,32,null,null,null,-5,-10,null,null,null,8,null,-8,null,null,"近接","0-1","雷",9,"スキルによらない武器攻撃ダメージに+5",65,null,{"$f":"IF(CS!$AJ$16=\"近接\",B13,IF(CS!$AJ$16=\"射撃\",B52,IF(CS!$AJ$16=\"魔術\",B91, )))","v":"紫電"}]
[null,"ウィンドブーメラン",null,null,1,null,null,null,null,2,30,null,null,null,3,1,1,1,null,2,6,null,null,null,"近接","0-2","風",10,"効果なし",90,null,{"$f":"IF(CS!$AJ$16=\"近接\",B14,IF(CS!$AJ$16=\"射撃\",B53,IF(CS!$AJ$16=\"魔術\",B92, )))","v":"ウィンドブーメラン"}]
[null,"ドラゴンズブレード",null,null,null,null,null,null,1,2,48,null,null,null,4,2,6,null,6,4,3,3,null,null,"近接","0-1","近",9,"効果なし",120,null,{"$f":"IF(CS!$AJ$16=\"近接\",B15,IF(CS!$AJ$16=\"射撃\",B54,IF(CS!$AJ$16=\"魔術\",B93, )))","v":"ドラゴンズブレード"}]
[null,"--------近接2--------",null,null,null,null,null,null,null,null,null,null,null,null,null,null,null,null,null,null,null,null,null,null,null,null,null,null,null,0,null,"---- 限定武器 ----"]
[null,"ヘヴィアックス",null,null,-2,null,null,null,null,null,33,null,null,null,3,3,null,null,null,null,null,null,null,null,"近接","0-1","近",11,"効果なし",10,null,{"$f":"IF(CS!$AJ$16=\"近接\",B121,IF(CS!$AJ$16=\"射撃\",B135,IF(CS!$AJ$16=\"魔術\",B149, )))","v":"灼炎剣 -焔-"}]
[null,"ショートソード",null,null,null,null,null,null,null,2,11,null,null,null,1,1,null,null,null,null,null,null,null,null,"近接","0-1","近",9,"効果なし",10,null,{"$f":"IF(CS!$AJ$16=\"近接\",B122,IF(CS!$AJ$16=\"射撃\",B136,IF(CS!$AJ$16=\"魔術\",B150, )))","v":"アイスサーベル"}]
[null,"アイアンシックル",null,null,null,null,-1,null,null,null,27,null,null,null,-3,-3,-3,-3,-3,-3,-3,-3,-3,-3,"近接","0-1","近",10,"効果なし",20,null,{"$f":"IF(CS!$AJ$16=\"近接\",B123,IF(CS!$AJ$16=\"射撃\",B137,IF(CS!$AJ$16=\"魔術\",B151, )))","v":"風魔槍 -鎌鼬-"}]
[null,"ロングソード",null,null,-1,null,null,null,null,-1,35,null,null,null,6,null,1,1,1,null,null,null,null,null,"近接","0-2","近",11,"効果なし",25,null,{"$f":"IF(CS!$AJ$16=\"近接\",B124,IF(CS!$AJ$16=\"射撃\",B138,IF(CS!$AJ$16=\"魔術\",B152, )))","v":"電流警棒"}]
[null,"鉄槌",null,null,-1,null,-1,null,null,-1,36,null,null,null,3,3,1,1,1,1,1,1,null,null,"近接","0-1","近",12,"この武器による攻撃の命中Ｃ値-1 (下限値：15)",35,null,{"$f":"IF(CS!$AJ$16=\"近接\",B125,IF(CS!$AJ$16=\"射撃\",B139,IF(CS!$AJ$16=\"魔術\",B153, )))","v":"隕鉄拳"}]
[null,"マン・ゴーシュ",null,null,null,null,1,null,null,1,20,null,null,null,8,null,-2,-2,-2,null,null,null,null,null,"近接","0-1","近",10,"効果なし",35,null,{"$f":"IF(CS!$AJ$16=\"近接\",B126,IF(CS!$AJ$16=\"射撃\",B140,IF(CS!$AJ$16=\"魔術\",B154, )))","v":"アシッドウィップ"}]
[null,"業物：凍河",null,null,null,null,null,null,null,null,28,null,null,null,2,2,-14,14,6,null,null,null,null,null,"近接","0-1","氷",10,"効果なし",50,null,{"$f":"IF(CS!$AJ$16=\"近接\",B127,IF(CS!$AJ$16=\"射撃\",B141,IF(CS!$AJ$16=\"魔術\",B155, )))","v":"ミステリーハンマー"}]
[null,"業物：漆黒",null,null,null,null,null,null,null,null,28,null,null,null,2,2,1,1,1,1,1,1,-14,14,"近接","0-1","闇",10,"効果なし",50,null,{"$f":"IF(CS!$AJ$16=\"近接\",B128,IF(CS!$AJ$16=\"射撃\",B142,IF(CS!$AJ$16=\"魔術\",B156, )))","v":"パワーグローブ"}]
[null,"アゾット剣",null,null,null,null,null,1,1,1,23,10,null,null,null,null,2,2,2,2,2,2,3,3,"近接","0-1","近",9,"各戦闘のBﾌｪｲｽﾞ中、最初に使用したｽｷﾙ代償-15MP",60,null,{"$f":"IF(CS!$AJ$16=\"近接\",B129,IF(CS!$AJ$16=\"射撃\",B143,IF(CS!$AJ$16=\"魔術\",B157, )))","v":"ライダーランス"}]
[null,"スターセイバー",null,null,null,null,null,null,null,null,32,null,null,null,3,3,null,null,null,null,null,null,12,12,"近接","0-1","光",9,"あなたは「BS：呪い」を受けない。",75,null,{"$f":"IF(CS!$AJ$16=\"近接\",B130,IF(CS!$AJ$16=\"射撃\",B144,IF(CS!$AJ$16=\"魔術\",B158, )))","v":"バンブースピア"}]
[null,"フレアアックス",null,null,null,null,null,null,null,-2,40,null,5,null,5,5,13,2,-5,null,null,null,null,null,"近接","0-1","炎",9,"あなたは「BS：凍結」を受けない。",75,null,"---- スキル武器 ----"]
[null,"大業物：皆中",null,null,3,null,null,null,null,null,35,null,null,null,4,4,null,null,null,null,null,null,null,null,"近接","0-1","近",9,"効果なし",100,null,{"$f":"IF(CS!$AJ$16=\"近接\",B164,IF(CS!$AJ$16=\"射撃\",B184,IF(CS!$AJ$16=\"魔術\",B198, )))&\"\"","v":"イービルスレイヤー"}]
[null,"--------近接3--------",null,null,null,null,null,null,null,null,null,null,null,null,null,null,null,null,null,null,null,null,null,null,null,null,null,null,null,0,null,{"$f":"IF(CS!$AJ$16=\"近接\",B165,IF(CS!$AJ$16=\"射撃\",B185,IF(CS!$AJ$16=\"魔術\",B199, )))&\"\"","v":"死神の鎌"}]
[null,"グランドハンマー",null,null,null,null,-1,null,null,-5,38,null,8,null,6,6,null,null,null,null,3,3,null,null,"近接","0-1","土",12,"効果なし",40,null,{"$f":"IF(CS!$AJ$16=\"近接\",B166,IF(CS!$AJ$16=\"射撃\",B188,IF(CS!$AJ$16=\"魔術\",B200, )))&\"\"","v":"LAEVATEINN"}]
[null,"メタルクロー",null,null,null,null,null,null,null,4,21,null,null,null,10,null,null,null,null,null,null,null,null,null,"近接","0-1","近",10,"効果なし",40,null,{"$f":"IF(CS!$AJ$16=\"近接\",B167,IF(CS!$AJ$16=\"射撃\",B189,IF(CS!$AJ$16=\"魔術\",B201, )))&\"\"","v":"アイストライデント"}]
[null,"バトルアンブレラ",null,null,null,null,null,null,null,-1,29,null,null,null,3,null,null,null,null,null,null,null,null,null,"近接","0-1","近",10,"効果なし",45,null,{"$f":"IF(CS!$AJ$16=\"近接\",B169,IF(CS!$AJ$16=\"射撃\",B190,IF(CS!$AJ$16=\"魔術\",B202, )))&\"\"","v":"ツララランス"}]
[null,"モーニングスター",null,null,null,null,null,null,null,null,28,null,null,null,7,8,1,1,1,1,1,1,3,12,"近接","0-2","光",10,"効果なし",60,null,{"$f":"IF(CS!$AJ$16=\"近接\",B170,IF(CS!$AJ$16=\"射撃\",B191,IF(CS!$AJ$16=\"魔術\",B203, )))&\"\"","v":"ブラッドブレード"}]
[null,"魔断チェーンソー",null,null,null,null,null,null,null,null,40,null,null,null,2,null,null,null,null,null,null,null,null,null,"近接","0-1","近",9,"命中判定のF値に+3 (上限値：10)",65,null,{"$f":"IF(CS!$AJ$16=\"近接\",B171,IF(CS!$AJ$16=\"射撃\",B192,IF(CS!$AJ$16=\"魔術\",B204, )))&\"\"","v":"ヌルウェポン"}]
[null,"スパークスピア",null,null,-1,null,null,null,null,2,40,null,null,null,6,4,2,2,2,13,null,-7,null,null,"近接","0-1","雷",11,"効果なし",70,null,{"$f":"IF(CS!$AJ$16=\"近接\",B172,IF(CS!$AJ$16=\"射撃\",B193,IF(CS!$AJ$16=\"魔術\",B205, )))&\"\"","v":"Qソード"}]
[null,"サウザンドテイル",null,null,1,null,null,null,null,2,27,null,6,null,3,2,null,null,null,null,null,null,null,null,"近接","0-1","近",10,"命中判定のF値に-1 ",75,null,{"$f":"IF(CS!$AJ$16=\"近接\",B173,IF(CS!$AJ$16=\"射撃\",B194,IF(CS!$AJ$16=\"魔術\",B206, )))&\"\"","v":"ムーンブレード"}]
[null,"ペンタシールド",null,null,null,null,null,null,1,null,23,null,25,null,8,8,9,9,9,9,null,9,null,null,"近接","0-1","近",13,"効果なし",85,null,{"$f":"IF(CS!$AJ$16=\"近接\",B174,IF(CS!$AJ$16=\"射撃\",B195,IF(CS!$AJ$16=\"魔術\",B207, )))&\"\"","v":"ライトセーバー"}]
[null,"名刀 -桜花-",null,null,1,null,null,null,null,null,38,null,null,null,13,null,2,2,null,null,4,3,null,null,"近接","0-1","近",11,{"$f":"\"自身の戦闘で最初の攻撃で与えるﾀﾞﾒｰｼﾞに+\"&CL*3+12","v":"自身の戦闘で最初の攻撃で与えるﾀﾞﾒｰｼﾞに+15"},90,null,{"$f":"IF(CS!$AJ$16=\"近接\",B178,IF(CS!$AJ$16=\"射撃\",B196,IF(CS!$AJ$16=\"魔術\",B208, )))&\"\"","v":"雷水晶の剣"}]
[null,"音速槍",null,null,1,null,null,null,null,2,41,null,null,null,4,2,null,null,null,null,null,null,null,null,"近接","0-1","近",9,"攻撃時7MP消費して、「射程：0-5」に変更可。",100,null,{"$f":"IF(CS!$AJ$16=\"近接\",B179,IF(CS!$AJ$16=\"射撃\",B197,IF(CS!$AJ$16=\"魔術\",B209, )))&\"\"","v":"宵闇の氷槍"}]
[null,"スーパーグローブ",null,null,-1,null,null,null,null,6,50,null,15,null,16,2,1,1,1,1,1,1,4,4,"近接","0-1","近",11,"素手扱い武器",120]
[null,"EXCALIBUR-C",null,null,1,null,1,null,1,3,36,10,15,10,12,6,5,5,3,3,3,4,4,4,"近接","0-1","光",9,{"$f":"\"10の倍数ｶｳﾝﾄ終了時、あなたは【HP】\"&10+CL*2&\"点回復\"","v":"10の倍数ｶｳﾝﾄ終了時、あなたは【HP】12点回復"},140]
[null,"--------射撃1--------",null,null,null,null,null,null,null,null,null,null,null,null,null,null,null,null,null,null,null,null,null,null,null,null,null,null,null,0]
[null,"9mm拳銃",null,null,null,null,null,null,null,1,5,null,null,null,null,null,null,null,null,null,null,null,null,null,"射撃","0-4","遠",9,"3ﾏｽ以上離れた対象への攻撃には命中達成値-2",10]
[null,"ハードボウ",null,null,null,1,null,null,null,-1,5,null,null,null,1,1,null,null,null,null,null,null,null,null,"射撃","2-4","遠","(3)→6","効果なし",10]
[null,"マグナム",null,null,null,null,null,null,null,1,10,null,null,null,null,null,null,null,null,null,null,null,null,null,"射撃","0-4","遠",10,"3ﾏｽ以上離れた対象への攻撃には命中達成値-2",20]
[null,"ハードボウ弐式",null,null,null,1,null,null,null,-2,10,null,null,null,null,null,null,null,null,null,null,null,null,null,"射撃","2-4","遠","(3)→6","効果なし",20]
[null,"エッジヨーヨー",null,null,null,null,null,null,null,1,16,null,null,null,null,null,null,null,null,null,null,null,null,null,"射撃","0-2","遠",9,"効果なし",35]
[null,"マジック砲 -MC2-",null,null,null,null,null,null,null,null,15,null,null,null,2,2,null,null,null,null,null,null,null,null,"射撃","3-4","遠",10,"スキルでこの武器を使用した場合ダメージ+5",45]
[null,"Mスーパーボール",null,null,null,null,null,null,null,null,16,null,null,null,1,1,null,null,null,null,null,null,null,null,"射撃","0-2","遠",9,"効果なし",50]
[null,"魔法手裏剣",null,null,null,1,null,null,null,1,18,null,null,null,null,null,null,null,null,null,3,null,null,null,"射撃","0-3","風",9,"この武器で攻撃を行う度、【MP】2点消費",60]
[null,"小型電磁砲",null,null,null,1,-1,null,null,-1,24,null,null,null,3,3,1,1,1,-5,null,null,null,null,"射撃","2-3","遠",10,"効果なし",75]
[null,"SMG",null,null,null,1,null,null,null,null,21,null,null,null,2,2,null,null,null,null,null,null,null,null,"射撃","0-3","遠",9,"効果なし",85]
[null,"レーザーガン.prot",null,null,null,null,null,null,null,null,37,null,null,null,2,null,null,null,null,null,null,null,null,null,"射撃","2-4","遠",10,"この武器を装備している時、移動コスト+2",90]
[null,"ロケットランチャー",null,null,null,null,-1,null,-1,-3,48,null,null,null,2,2,2,null,null,null,null,null,null,null,"射撃","2-4","遠",12,"攻撃時、自身より後方ﾏｽの味方に実ﾀﾞﾒｰｼﾞ30点与える。",130]
[null,"--------射撃2--------"]
[null,"スローイングダガー",null,null,null,null,null,null,null,null,8,null,null,null,null,null,null,null,null,null,null,null,null,null,"射撃",{"$f":"IF(CS!B18>=15,\"0-3\",\"0-2\")","v":"0-2"},"遠",9,"あなたの【肉体】が15以上の時、「射程：0-3」に変更。",10]
[null,"スリングショット",null,null,null,null,null,null,null,null,13,null,null,null,null,null,null,null,null,null,null,null,null,null,"射撃","0-3","遠","(2)→7","効果なし",10]
[null,"散弾銃",null,null,null,1,-1,null,null,-2,12,null,null,null,null,null,null,null,null,null,null,null,null,null,"射撃","0-4","遠",10,"3ﾏｽ以上離れた対象への攻撃には命中達成値-2",20]
[null,"チャクラム",null,null,null,null,null,null,null,null,14,null,null,null,null,null,null,null,null,null,null,null,null,null,"射撃","0-3","遠","(2)→7","効果なし",20]
[null,"ワイヤースタンガン",null,null,null,null,null,null,null,null,14,null,null,null,2,2,null,null,null,3,null,null,null,null,"射撃","0-2","雷",10,"命中判定でｸﾘﾃｨｶﾙした場合、「BS：麻痺」を付与",25]
[null,"飛苦無",null,null,null,1,null,null,null,null,11,null,null,null,4,null,null,null,null,null,null,null,null,null,"射撃","0-2","遠",9,"効果なし",30]
[null,"四方手裏剣",null,null,null,null,null,null,null,null,17,null,null,null,-3,-3,null,null,null,null,null,null,null,null,"射撃","0-3","遠",9,"効果なし",30]
[null,"マジック砲 -MC5-",null,null,null,1,null,null,null,null,8,null,null,null,4,4,null,null,null,null,null,null,null,null,"射撃","0-3","風",10,"スキルでこの武器を使用した場合ダメージ+10",45]
[null,"ハイドロガン",null,null,null,null,null,null,null,-1,20,null,null,null,3,3,14,3,3,-5,null,null,null,null,"射撃","0-3","水",10,"命中判定でｸﾘﾃｨｶﾙした場合、「BS：怯み(1)」を付与",60]
[null,"スナイパーライフル",null,null,null,1,null,null,null,-3,26,null,null,null,3,3,null,null,null,null,null,null,null,null,"射撃","1-4","遠","(4)→8","「射程：1-2」内の対象への攻撃には命中達成値-3",70]
[null,"対物ライフル",null,null,null,1,-1,null,null,-3,31,null,null,null,-4,-4,null,null,null,null,null,null,null,null,"射撃","0-4","遠",11,"ｻﾌﾞで移動した行動手番中は攻撃不可。",80]
[null,"火炎放射器",null,null,null,null,null,null,null,-2,35,null,null,null,3,3,5,5,null,null,null,null,null,null,"射撃","0-2","炎",11,"効果なし",85]
[null,"--------射撃3--------"]
[null,"バーナーキャノン",null,null,null,1,null,null,null,-1,17,null,null,null,null,2,8,12,2,2,null,null,null,null,"射撃","0-3","炎",11,"この武器を使用する攻撃の場合、4MP消費。",40]
[null,"風刃砲",null,null,null,null,null,null,null,1,17,null,null,null,3,3,12,6,7,null,8,null,null,null,"射撃","0-4","風",11,"命中判定の出目18以上で、ダメージ+20",40]
[null,"フリスピーシールド",null,null,null,null,null,null,null,-2,13,null,8,null,16,14,10,6,6,5,7,7,4,4,"射撃","0-2","遠","(4)→7","効果なし",45]
[null,"フリーズキャノン",null,null,null,null,-1,null,null,-4,26,null,null,null,5,2,-5,16,8,3,3,3,null,null,"射撃","0-3","氷","(4)→8","効果なし",50]
[null,"レーザーサック",null,null,null,null,null,null,null,null,19,null,null,2,null,null,null,null,null,null,null,null,5,5,"射撃","0-2","光",10,"効果なし",55]
[null,"マジカルバルカン",null,null,null,1,-1,null,null,-4,24,null,null,3,4,8,3,1,1,1,1,null,null,null,"射撃","0-3","遠",12,"効果なし",60]
[null,"ヴァリアントボウ",null,null,null,1,null,null,null,null,14,null,null,null,4,8,null,null,null,null,null,null,3,3,"射撃","3-4","遠",11,"自身から3ﾏｽにいる対象への攻撃ダメージ+2D10",70]
[null,"ヘヴィキャノン",null,null,null,-2,-1,null,-1,-3,38,null,null,null,8,4,3,2,2,3,3,3,null,null,"射撃","0-3","遠","(2)→9","効果なし",80]
[null,"ロックブラスター",null,null,null,1,null,null,null,-2,25,null,null,null,11,9,3,4,null,6,7,11,null,null,"射撃","0-3","土","(4)→7","命中判定のF値に+2。 (上限値：8)",80]
[null,"ブラックボウガン",null,null,null,1,-1,null,null,-4,33,null,10,null,13,11,2,2,2,2,2,2,8,8,"射撃","2-4","遠","(4)→9","命中判定のC値に-1。 (下限値：16)",95]
[null,"ショットオプション",null,null,null,1,null,null,null,1,31,null,null,null,8,8,null,null,null,null,null,null,null,null,"射撃","0-4","※",11,"攻撃宣言時に無属性以外の武器属性指定可能。",135]
[null,"ネオアサルト",null,null,null,2,-1,null,null,-4,41,null,null,null,6,4,null,null,null,null,null,null,null,null,"射撃","0-5","遠",10,"あなたが行う攻撃のコストに-1。(下限値：6)",180]
[null,"--------魔法1--------"]
[null,"スタッフ",null,null,null,null,null,null,null,null,null,8,null,null,null,null,1,1,1,1,1,1,null,null,"魔法","0-3","遠","(3)→7","スキルによらない武器攻撃ダメージに+15",10]
[null,"マジカルワンド",null,null,null,null,null,1,null,null,null,5,null,null,null,null,1,1,1,1,1,1,null,null,"魔法","0-3","遠","(3)→7","スキルによらない武器攻撃ダメージに+17",10]
[null,"ファイアロッド",null,null,null,null,null,1,null,null,null,10,null,null,null,null,8,-4,1,1,1,null,null,null,"魔法","0-3","炎","(4)→6","スキルによらない武器攻撃ダメージに+22",20]
[null,"フリーズロッド",null,null,null,null,null,1,null,null,null,10,null,null,null,null,-4,8,1,1,1,null,null,null,"魔法","0-3","氷","(4)→6","スキルによらない武器攻撃ダメージに+22",20]
[null,"祝福の杖",null,null,null,null,null,null,null,null,null,16,null,4,null,null,3,3,3,3,3,3,null,null,"魔法","0-2","光","(2)→8","効果なし",35]
[null,"ガードロッド",null,null,null,null,null,1,null,-2,null,12,null,null,3,3,4,2,3,1,2,2,1,1,"魔法","0-3","遠","(4)→6","「種別：防」のｽｷﾙ代償-1MP (下限：1MP)",45]
[null,"アンプリファー",null,null,null,null,-1,null,null,null,null,21,null,null,1,1,-2,-2,-2,-2,-2,-2,-3,-3,"魔法","0-3","近","(3)→11","スキルによらない武器攻撃ダメージに+35",50]
[null,"天雷杖",null,null,null,null,null,null,null,2,null,14,null,null,null,null,null,null,null,10,null,-5,null,null,"魔法","3-3","雷","(3)→8","スキルによらない武器攻撃ダメージに+31",60]
[null,"WPリング",null,null,null,null,1,1,null,2,null,22,null,null,3,null,1,1,1,1,6,null,null,null,"魔法","0-3","風","(2)→11","スキルによらない武器攻撃ダメージに+15",75]
[null,"スターティンクル",null,null,null,null,null,1,null,1,null,31,null,3,1,1,2,2,2,2,4,null,7,null,"魔法","0-2","光","(4)→9","スキルによらない武器攻撃ダメージに+15",85]
[null,"アーススタッフ",null,null,null,null,null,1,null,null,null,35,null,null,3,1,2,2,2,null,null,5,null,null,"魔法","0-3","土","(5)→9","スキルによらない武器攻撃ダメージに+15",90]
[null,"ディープロッド",null,null,null,null,1,1,1,null,null,48,null,3,2,2,8,4,8,-10,null,null,null,null,"魔法","0-4","水","(4)→10","スキルによらない武器攻撃ダメージに+15",130]
[null,"--------魔法2--------"]
[null,"マジックグローブ",null,null,null,null,null,null,null,null,null,10,null,null,null,null,null,null,null,null,null,null,null,null,"魔法","0-3","遠","(2)→8","スキルによらない武器攻撃ダメージに+15",10]
[null,"スペルオーブ",null,null,null,null,null,null,null,null,null,7,null,null,-3,-3,1,1,1,1,1,1,null,null,"魔法","0-3","遠","(3)→6","1ｾｯｼｮﾝに1度、自身の判定を振りなおせる(ｺｽﾄ：0)",10]
[null,"サンダーロッド",null,null,null,null,null,1,null,null,null,10,null,null,null,null,null,1,1,8,1,-4,null,null,"魔法","0-3","雷","(4)→6","スキルによらない武器攻撃ダメージに+22",20]
[null,"ウェイブロッド",null,null,null,null,null,1,null,null,null,10,null,null,null,null,null,1,8,-4,1,1,null,null,"魔法","0-3","水","(4)→6","スキルによらない武器攻撃ダメージに+22",20]
[null,"ホーリーワンド",null,null,null,null,null,null,1,null,null,10,null,3,2,2,null,null,null,null,null,null,null,null,"魔法","0-2","光","(4)→6",{"$f":"\"「種別：回」のｽｷﾙの【HP】回復量に+\"&CL+5","v":"「種別：回」のｽｷﾙの【HP】回復量に+6"},40]
[null,"イービルワンド",null,null,null,null,null,null,null,null,null,18,null,null,null,null,null,null,null,null,null,null,-16,8,"魔法","0-3","闇","(3)→7","命中判定でｸﾘﾃｨｶﾙした場合、「BS：呪い」を付与",40]
[null,"ジュエルスタッフ",null,null,null,null,null,2,null,null,null,10,null,null,null,null,null,null,null,null,null,null,null,null,"魔法","0-3","近","(3)→9","スキルによらない武器攻撃ダメージに+25",55]
[null,"氷華杖",null,null,null,null,null,null,1,-1,null,19,null,null,2,2,-10,14,6,null,null,null,null,null,"魔法","2-3","氷","(3)→7","自身の攻撃宣言時に5MP支払い、属性を〈氷〉に変更可",60]
[null,"魔法剣",null,null,null,null,null,null,null,null,15,20,null,null,6,6,2,2,2,2,2,2,null,null,"魔法","0-3","近",12,"スキルによらない武器攻撃ダメージに+30",70]
[null,"ディバインロッド",null,null,null,null,null,1,2,null,null,17,null,3,3,3,null,null,null,null,null,null,4,16,"魔法","0-2","光","(4)→6",{"$f":"\"「種別：回」のｽｷﾙの【HP】回復量に+\"&CL*2+6","v":"「種別：回」のｽｷﾙの【HP】回復量に+8"},90]
[null,"クリスタルロッド",null,null,null,null,null,1,null,null,null,30,null,null,null,null,3,3,3,3,3,3,3,3,"魔法","0-3","遠","(2)→8","全てのスキルの代償に-1MPする。(下限値：3MP)",90]
[null,"エクリプスデイ",null,null,null,null,null,2,2,null,null,40,null,10,5,5,3,3,3,3,3,3,8,8,"魔法","0-4","※","(4)→8","この武器の属性は〈光〉〈闇〉の複合属性とする。",120]
[null,"--------魔法3--------"]
[null,"グリモワール",null,null,null,null,null,1,null,null,null,null,null,null,null,null,-5,null,null,null,null,null,null,null,"魔法","0-3","遠","(4)→6","効果なし",5]
[null,"強化対魔護符",null,null,null,null,null,null,null,null,null,8,null,5,4,3,null,null,null,null,null,null,6,6,"魔法","0-3","遠","(3)→8","「BS：封印」を受けない。",15]
[null,"魔笛",null,null,null,null,null,1,null,null,null,13,null,null,2,2,null,null,null,null,-3,-3,null,null,"魔法","0-4","遠","(5)→7","「BS：恐怖」を受けない。",20]
[null,"アンテナメット",null,null,null,null,null,1,null,null,null,19,null,null,2,2,null,null,null,-10,null,null,null,null,"魔法","0-3","近","(3)→7","戦闘で最初の攻撃の命中判定達成値+5",50]
[null,"ダークチョーカー",null,null,null,null,null,1,null,null,null,18,null,4,3,3,4,4,4,4,4,4,12,12,"魔法","0-2","闇","(3)→13","スキルによらない武器攻撃ダメージに+50",50]
[null,"ラッキーペンダント",null,null,null,null,null,1,null,1,null,11,null,null,3,3,null,null,null,null,null,null,null,null,"魔法","0-3","近",15,"[準備期間]でも《セカンドチャンス》使用可能。",85]
[null,"神秘の光球",null,null,null,null,null,1,1,null,null,14,null,3,3,3,4,4,4,4,4,4,10,15,"魔法","0-3","光","(3)→9","1戦闘1回、自身へのBS無効。",90]
[null,"ゼロポインター",null,null,null,null,null,1,null,null,null,13,null,3,5,5,4,4,4,4,4,4,4,4,"魔法","0-4","遠","(4)→10","[準備期間]でもダメージロールのｽｷﾙ使用可能。",95]
[null,"ワープブレスレット",null,null,null,null,null,null,null,2,null,31,null,null,2,2,-10,14,6,null,null,null,null,null,"魔法","2-3","遠","(3)→7","1戦闘1回、ｶｳﾝﾄ開始時に任意ﾏｽに移動可能。",95]
[null,"轟雷のアミュレット",null,null,null,null,1,null,1,3,null,26,null,6,2,2,null,null,null,13,null,-8,null,null,"魔法","0-3","雷",13,"「BS：麻痺」を受けない。",105]
[null,"インフィニティロッド",null,null,-2,-2,1,-4,2,-3,null,33,null,11,7,7,3,3,3,3,3,3,2,2,"魔法","0-2","遠","(3)→11","1戦闘3回、自身の判定を振り直し可能。",130]
[null,"七色の法典",null,null,null,null,1,2,1,2,null,35,null,null,5,5,7,7,7,7,7,7,7,7,"魔法","0-3","風","(7)→7","スキル代償に-1MP (下限値：1MP)",140]
[null,"--------限定--------"]
[null,"灼炎剣 -焔-",null,null,1,null,null,null,null,null,28,null,null,null,null,null,8,8,-5,null,null,-3,null,null,"近接","0-1","炎",9,"FS専用。《火炎閃》のﾀﾞﾒｰｼﾞ+2D6",60]
[null,"アイスサーベル",null,null,null,null,1,null,null,null,30,null,3,null,2,2,-6,12,6,null,null,null,null,null,"近接","0-1","氷",10,"FC専用。",60]
[null,"風魔槍 -鎌鼬-",null,null,null,null,1,null,null,1,34,null,null,null,null,null,null,null,null,null,12,null,null,null,"近接","0-1","風",10,"WR専用。攻撃時5MP消費して、「射程：0-2」に変更可。",60]
[null,"電流警棒",null,null,null,null,null,null,null,3,31,null,null,null,-5,-5,5,null,5,null,null,5,null,null,"近接","0-1","雷",9,"EE専用。命中の出目19以上の時、「BS：麻痺」付与。",60]
[null,"隕鉄拳",null,null,-1,null,null,null,null,2,32,null,null,null,-5,-5,3,3,null,null,1,3,null,null,"近接","0-1","土",9,"EB専用。素手扱い武器。命中F値-1。",60]
[null,"アシッドウィップ",null,null,2,null,null,null,null,null,28,null,null,null,3,3,null,null,10,null,null,null,null,null,"近接","0-1","水",9,"WT専用。《水流閃》の命中C値に-1する。",60]
[null,"ミステリーハンマー",null,null,1,null,null,null,null,null,21,null,null,null,null,null,4,4,4,4,4,4,null,null,"近接","0-1","近",8,"CR専用。武器で与えるﾀﾞﾒｰｼﾞに+[6D10-30]する。",60]
[null,"パワーグローブ",null,null,-1,null,null,null,null,3,37,null,null,null,-6,-6,null,null,null,null,null,null,null,null,"近接","0-1","近",9,"BR専用。素手扱い武器。",60]
[null,"ライダーランス",null,null,1,null,null,null,null,-2,38,null,null,null,4,4,null,null,null,null,null,null,null,null,"近接","0-1","近",10,"ER専用。[騎乗戦闘]時、全判定のF値-1。",60]
[null,"バンブースピア",null,null,1,null,1,null,null,2,28,null,null,null,null,null,-6,null,null,null,3,3,3,null,"近接","0-1","土",9,"PP専用。命中判定ｸﾘﾃｨｶﾙした場合、ﾀﾞﾒｰｼﾞに+CLD6",60]
[null,"ヴァリアブルスピア",null,null,1,null,null,null,null,null,18,null,6,8,3,3,null,null,null,null,null,null,null,null,"近接","0-1","近",10,"IA専用。 武器変更スキルの武器持続カウントに+3",60]
[null,"マジカルヌンチャク",null,null,-1,null,1,null,null,1,33,null,null,null,5,null,null,null,null,null,null,null,null,null,"近接","0-1","近",9,"SF専用。素手扱い武器。",60]
[null,"カラフルブレード",null,null,null,null,null,null,1,2,27,null,12,null,null,null,3,3,3,3,3,3,3,3,"近接","0-1","※",9,{"$f":"\"CI専用 この武器の属性は〈色属性〉となる\"","v":"CI専用 この武器の属性は〈色属性〉となる"},60]
[null,"ヒュージシールド",null,null,null,null,1,null,null,-5,27,null,15,null,13,12,11,10,6,12,14,7,8,6,"近接","0-1","近",12,"IS専用。準備期間中に受けるダメージに-5。",60]
[null,"カースライフル",null,null,null,1,null,null,null,-1,18,null,null,null,null,null,null,null,null,null,null,null,null,3,"射撃","0-4","遠","(1)→9","BS専用。「BS：呪印」を持つ対象への与ﾀﾞﾒｰｼﾞ+10。",60]
[null,"ブラックバズーカ",null,null,null,null,null,null,null,null,22,null,null,2,3,3,null,null,null,null,null,null,10,10,"射撃","0-3","闇",10,"VC専用。《ｳﾞｫｲﾄﾞｼｮｯﾄ》の代償に-1MPする。",60]
[null,"デリンジャー",null,null,null,1,null,null,null,1,16,null,null,null,-3,-3,null,null,null,null,null,null,null,null,"射撃","0-3","遠",9,"TM専用。戦闘開始時にﾄﾘｯｸｶｳﾝﾀｰを1つ得る。",60]
[null,"コントロールロッド",null,null,null,1,null,null,null,-1,18,null,null,null,3,3,9,-5,-5,null,null,null,2,4,"射撃","0-3","炎","(2)→7","AB専用。《ｱﾄﾐｯｸﾊﾞｽﾀｰ》と《ｼｬｲﾝﾊﾞｰｽﾄ》の代償-1MP。",60]
[null,"ライトスナイパー",null,null,null,1,null,null,null,-3,27,null,null,null,3,3,null,null,null,null,null,null,14,null,"射撃","0-4","光","(3)→7","BC専用。ｻﾌﾞで移動した行動手番中は攻撃不可。",60]
[null,"スーパーメガホン",null,null,null,1,null,null,1,null,21,null,null,null,3,3,null,null,null,null,null,null,null,null,"射撃","0-4","遠",10,"PD専用。命中の出目18以上の時、KB(1)」付与｡",60]
[null,"ホールドワイヤー",null,null,null,null,null,null,null,null,25,null,null,null,3,3,null,null,null,null,null,null,null,null,"射撃","0-4","遠",9,"TA専用。武器攻撃が命中した対象を1ﾏｽ前に配置。",60]
[null,"レーザーガン改",null,null,null,1,null,null,null,null,21,null,null,null,null,null,null,null,null,null,null,null,5,5,"射撃","2-3","光",8,"LS専用。《ﾚｰｻﾞｰｼｮｯﾄ》と《ﾃﾞﾄﾈｰｼｮﾝﾚｲ》の代償-1MP。",60]
[null,"カースクロスボウ",null,null,null,1,null,null,null,-2,23,null,null,null,-4,null,null,null,null,null,null,null,5,5,"射撃","2-4","闇","(3)→6","SA専用。武器攻撃の回避F値に+2。(上限値：11)",60]
[null,"バリアキャノン",null,null,null,null,null,null,null,null,15,null,null,null,7,7,3,3,3,3,3,3,4,4,"射撃","0-3","近","(3)→6","BD専用。1戦闘1回、常時[ﾊﾞﾘｱ状態]の付与解除可能。",60]
[null,"アンブレラガン",null,null,null,1,null,null,1,null,18,null,3,null,3,3,1,1,1,1,1,1,null,null,"射撃","0-3","遠",11,"WP専用。「種別：天」のスキルのSL上限に+1する。",60]
[null,"テレスコープガン",null,null,null,1,null,null,null,null,25,null,8,6,3,3,null,null,null,null,null,null,null,null,"射撃","0-3","遠",10,"DP専用。 命中C値-1 (下限値：15)",60]
[null,"ヘヴィガトリング",null,null,null,null,null,null,null,-5,41,null,null,null,11,9,null,null,null,null,null,null,null,null,"射撃","0-4","遠",12,"MA専用。移動ｺｽﾄに+3。",60]
[null,"ラッキーロングボウ",null,null,null,null,null,null,null,2,25,null,null,null,3,3,null,null,null,null,null,null,null,null,"射撃","0-4","遠",11,"LA専用。命中C値-1 (下限値：16)",60]
[null,"アルカナ-22",null,null,null,null,null,null,null,null,null,17,null,2,null,null,2,2,2,2,2,2,1,1,"魔法","0-2","遠","(3)→7","AS専用。30ｶｳﾝﾄ終了時にｱﾙｶﾅｶｳﾝﾀｰを1つ得る。",60]
[null,"人工エリクシル",null,null,null,null,null,1,1,null,null,17,null,null,null,null,6,null,6,null,6,6,null,null,"魔法","0-3","※","(4)→6","TE専用。武器属性は「専攻属性」から1つ選択する。",60]
[null,"アルカナセッター",null,null,null,null,null,1,null,1,null,15,null,null,3,3,null,null,null,null,null,null,null,null,"魔法","1-3","遠","(5)→6","AG専用。《ｱﾙｶﾅｽﾄﾗｲｸ》の代償-1MP。(下限：2MP)",60]
[null,"セブンスワンド",null,null,null,null,null,null,null,null,null,16,null,null,null,null,2,null,2,2,2,2,2,2,"魔法","0-4","光","(2)→8","OK専用。「種別：宝」ｽｷﾙの代償-1MP。(下限：3MP)",60]
[null,"陰陽符",null,null,null,null,null,null,null,null,null,19,null,null,1,1,null,null,null,null,null,null,4,4,"魔法","1-4","※","(3)→8","YM専用。武器属性は「陰陽属性」となる。",60]
[null,"マジカルウォッチ",null,null,null,null,null,null,1,null,null,23,null,null,null,null,null,null,null,null,null,null,null,3,"魔法","0-1","闇",11,{"$f":"\"TD専用。ｽｷﾙによらない武器攻撃ﾀﾞﾒｰｼﾞに+\"&15+CL*3&\"する。\"","v":"TD専用。ｽｷﾙによらない武器攻撃ﾀﾞﾒｰｼﾞに+18する。"},60]
[null,"クレイジーアイ",null,null,null,null,null,null,null,null,null,17,null,5,7,7,null,null,null,null,null,null,null,null,"魔法","0-4","遠","(3)→8","MV専用。武器攻撃に対する回避C値に+1する。",60]
[null,"忍術大全",null,null,null,null,null,2,null,null,null,10,null,null,null,null,2,2,2,2,2,2,null,null,"魔法","0-4","遠","(3)→8","SN専用。ｽｷﾙの代償に-1MPする。(下限値：10MP)",60]
[null,"人形強化の書",null,null,1,null,null,1,null,null,null,11,null,null,3,3,null,null,null,null,null,null,3,3,"魔法","0-3","遠","(5)→5","CP専用。「ﾄﾞｰﾙ」と名の付く味方の【耐久力】に+20。",60]
[null,"禁じられた書物",null,null,null,null,null,null,null,null,null,25,-15,5,null,null,2,2,2,2,2,2,2,2,"魔法","0-3","遠","(4)→6","FM専用。",60]
[null,"スターダストロッド",null,null,null,null,null,1,null,2,null,15,null,4,null,null,3,3,3,3,3,3,3,3,"魔法","0-3","光","(4)→7","AW専用。クラス特典を15ｶｳﾝﾄ終了時までとする。",60]
[null,"クリアウィングリスト",null,null,null,null,null,1,null,null,null,21,null,4,2,4,3,1,3,1,3,1,null,null,"魔法","0-3","近","(4)→8",{"$f":"\"VM専用 「種別：回」のｽｷﾙの【HP】回復量に+\"&CL*2+8","v":"VM専用 「種別：回」のｽｷﾙの【HP】回復量に+10"},60]
[null,"ゼログローブ",null,null,null,null,null,1,null,null,null,16,null,10,4,4,null,null,null,null,null,null,null,null,"魔法","0-3","遠","(2)→9","ZP専用。1戦闘1回、ｶｳﾝﾄ開始時にMP0にできる。",60]
[null,"メタリックロッド",null,null,null,null,null,null,1,null,null,15,null,3,4,4,8,8,8,null,8,8,6,6,"魔法","0-3","近","(3)→8","MW専用。あなたは「BS：毒(X)」を受けない。",60]
[null,"--------スキル--------"]
[null,"イービルスレイヤー",null,null,1,null,null,null,null,null,{"$f":"(SL+CL)*5+15","v":20},null,null,null,null,null,null,null,null,null,null,null,null,{"$f":"20+CL*2","v":22},"近接","0-1","光",8,{"$f":"\"〈闇〉耐性+\"&20+CL*2","v":"〈闇〉耐性+22"}]
[null,"死神の鎌",null,null,null,null,null,null,null,null,{"$f":"CL*8+30","v":38},null,null,null,{"$f":"CL*8","v":8},{"$f":"CL*8","v":8},null,null,null,null,null,null,null,null,"近接","0-1","闇",8,{"$f":"\"BS無効。〈近〉〈遠〉耐性+\"&CL*8","v":"BS無効。〈近〉〈遠〉耐性+8"}]
[null,"LAEVATEINN",null,null,null,null,null,null,2,null,{"$f":"15+SL*6","v":15},null,null,null,null,null,{"$f":"SL*2+CL","v":1},null,null,{"$f":"SL*2+CL","v":1},null,null,{"$f":"SL*2+CL","v":1},null,"近接","0-1","炎",11,{"$f":"\"〈炎〉〈雷〉〈光〉耐性+\"&(SL*2)+CL","v":"〈炎〉〈雷〉〈光〉耐性+1"}]
[null,"アイストライデント",null,null,1,null,1,null,2,null,{"$f":"(SL+CL)*4","v":4},null,null,null,null,null,null,null,null,null,null,null,null,null,"近接","0-3","氷",8,"効果なし"]
[null,"付喪武器",null,null,1,null,1,null,null,null,{"$f":"(SL+CL)*4","v":4},null,null,null,null,null,null,null,null,null,null,null,null,null,"近接","0-1","近",10]
[null,"ツララランス",null,null,null,null,2,null,null,null,{"$f":"SL*4+15","v":15},null,null,null,null,null,null,20,null,null,null,null,null,null,"近接","0-2","氷",8,"全C値-1(下限：15) 全F値+1 〈氷〉耐性+20"]
[null,"ブラッドブレード",null,null,null,null,null,null,null,null,{"$f":"(SL+CL)*5","v":5},null,null,null,null,null,null,null,null,null,null,null,null,null,"近接","0-1","近",8,"[与えたダメージ/4](↓)点【HP】を回復する。"]
[null,"ヌルウェポン",null,null,null,null,null,null,null,null,{"$f":"(SL*4)+10","v":10},null,null,null,null,null,null,null,null,null,null,null,{"$f":"SL+CL","v":1},{"$f":"SL+CL","v":1},"近接","0-1","無",10,{"$f":"\"〈光〉〈闇〉耐性+\"&SL+CL","v":"〈光〉〈闇〉耐性+1"}]
[null,"Qソード",null,null,1,null,null,null,null,null,{"$f":"(SL+CL)*4","v":4},null,null,null,null,null,{"$f":"SL*2","v":0},null,{"$f":"SL*2","v":0},null,{"$f":"SL*2","v":0},{"$f":"SL*2","v":0},null,null,"近接","0-1","炎水風土",8,{"$f":"\"〈炎〉〈水〉〈風〉〈土〉耐性+\"&SL*2","v":"〈炎〉〈水〉〈風〉〈土〉耐性+0"}]
[null,"ムーンブレード",null,null,null,null,null,null,null,null,{"$f":"SL*4+18","v":18},null,null,null,null,null,null,null,null,null,null,null,{"$f":"CL*2","v":2},{"$f":"CL*2","v":2},"近接","0-1","闇",8,"【近接値】+N 〈光〉〈闇〉耐性+[N×CL×2] N=消費AC"]
[null,"ライトセーバー",null,null,2,null,null,null,2,null,{"$f":"SL*4+24","v":24},null,null,null,null,null,null,null,null,null,null,null,null,null,"近接","0-1","光",9,"効果なし"]
[null,"彗星の剣",null,null,null,null,null,null,null,null,{"$f":"(SL+CL)*4","v":4},null,null,null,null,null,null,null,null,null,null,null,{"$f":"SL*3","v":0},{"$f":"SL*3","v":0},"近接","0-1","光",10,"回避C値-1 (下限値：15)"]
[null,"Sシールド",null,null,null,null,null,null,1,-10,{"$f":"SL*4+20","v":20},null,null,null,{"$f":"SL*3","v":0},{"$f":"SL*3","v":0},null,null,null,null,null,null,null,null,"近接","0-1","近",13,{"$f":"\"常時、受けるダメージを\"&SL+CL*3&\"点軽減する。\"","v":"常時、受けるダメージを3点軽減する。"}]
[null,"魔法双剣",null,null,null,null,null,null,null,null,{"$f":"SL*5+13","v":13},null,null,null,null,null,null,null,null,null,null,null,null,null,"近接","0-1","近",13,{"$f":"\"「種別：魔」ｽｷﾙによる攻撃の与ﾀﾞﾒｰｼﾞに+2D10+\"&ROUNDDOWN(CS!AI37/2,0)","v":"「種別：魔」ｽｷﾙによる攻撃の与ﾀﾞﾒｰｼﾞに+2D10+16"}]
[null,"雷水晶の剣",null,null,null,null,2,null,null,null,{"$f":"SL*5+18","v":18},null,null,null,null,null,null,null,null,{"$f":"CL*8","v":8},null,null,null,null,"近接","0-2","雷",8,{"$f":"\"〈雷〉耐性+\"&CL*8&\" 全ｽｷﾙ代償-1MP。(下限：1MP)\"","v":"〈雷〉耐性+8 全ｽｷﾙ代償-1MP。(下限：1MP)"}]
[null,"宵闇の氷槍",null,null,2,null,null,null,null,null,{"$f":"(SL+CL)*5","v":5},null,null,null,null,null,null,{"$f":"CL*5","v":5},{"$f":"CL*5","v":5},null,null,null,{"$f":"CL*5","v":5},{"$f":"CL*5","v":5},"近接","0-2","氷闇",9,{"$f":"\"〈氷〉〈水〉〈光〉〈闇〉耐性+\"&CL*5","v":"〈氷〉〈水〉〈光〉〈闇〉耐性+5"}]
[null,"ABYSS",null,null,3,null,null,null,null,null,{"$f":"SL*9","v":0},null,null,null,null,null,null,null,null,null,null,null,null,null,"近接","0-1","近",10,"物攻に《ｱｰﾑｽﾞﾌｫｰｽ》のSL×4の補正が発生。"]
[null,"破天手甲",null,null,null,null,null,null,null,null,{"$f":"(SL+CL+2)*5","v":15},null,null,null,{"$f":"SL*5","v":0},null,{"$f":"CL","v":1},{"$f":"CL","v":1},null,null,null,null,null,null,"近接","0-1","近",9,"命中C値-1 (下限値：15) 1度の移動で2ﾏｽ移動可能"]
[null,"追憶の名剣",null,null,2,null,null,null,null,null,{"$f":"(SL+CL)*4","v":4},null,null,null,null,null,null,null,null,null,null,null,null,null,"近接","0-1","近",11,{"$f":"IF(SL<CL,\"効果なし\",\"攻撃によって与えるダメージに+[未使用の感情×\"&CL&\"]\")","v":"効果なし"}]
[null,"エアブレイカー",null,null,null,1,null,null,null,null,{"$f":"SL*5+15","v":15},null,null,null,null,null,null,null,null,null,null,null,null,null,"射撃","0-3","遠",10,"この武器による攻撃は耐性以外でﾀﾞﾒｰｼﾞ軽減不可。"]
[null,"ノイズガン",null,null,null,2,null,null,null,null,{"$f":"(SL+CL)*4","v":4},null,null,null,null,null,null,null,null,null,null,null,null,null,"射撃","0-4","風",9,"KB(X)無効 全ｽｷﾙに「種別：音」付与。"]
[null,"BLR",null,null,null,null,-2,null,2,null,{"$f":"SL*3+CS!$AI$39","v":17},null,null,null,null,null,null,null,null,null,null,null,null,null,"射撃","0-5","光",8]
[null,"ブラッディアS",null,null,null,2,null,null,null,null,{"$f":"SL*4+CL*3","v":3},null,null,null,null,null,null,null,null,null,null,null,null,null,"射撃","0-5","遠",11,"呪印を受けている対象に呪印付与時、怯み(2)も追加。"]
[null,"特大手裏剣",null,null,null,1,null,null,null,null,{"$f":"SL*5+CL*5","v":5},null,null,null,null,null,null,null,null,null,null,null,null,null,"射撃","0-3","遠",10,"装備時、《手裏剣術》の使用回数を1回分回復する。"]
[null,"ルーンデスサイズ",null,null,null,null,null,null,null,null,null,{"$f":"CL*3","v":3},null,null,null,null,null,null,null,null,null,null,{"$f":"CL*SL","v":0},null,"魔法","2-4","闇","(3)→6",{"$f":"\"【魔術値】判定した攻撃のﾀﾞﾒｰｼﾞ+\"&20+CL*SL*3&\"する。〈光〉耐性+\"&CL*SL","v":"【魔術値】判定した攻撃のﾀﾞﾒｰｼﾞ+20する。〈光〉耐性+0"}]